program: Gaussian 09
title: 000241984
version: EM64L-G09RevD.01
frameworkgroup: C1[X(C18H13ClN6)]
method: RPBEPBE
basis: SDD
operation: Freq
keyword: #p
keyword: freq=noraman
keyword: PBEPBE/SDD
title: #p freq=noraman PBEPBE/SDD
converged: YES YES NO NO
title: Mulliken charges:
elementType: Cl N N N N N N C C C C C C C C C C C C C C C C C C H H H H H H H H H H H H H
charge: -0.046073 -0.033021 0.003415 -0.010388 -0.061356 -0.633843 -0.613268 -0.020837 -0.148026 -0.044934 0.328628 0.055374 -0.124183 0.110044 0.305434 -0.371603 -0.410910 -0.356768 -0.353166 -0.210043 -0.215350 -0.109094 -0.231556 -0.231771 -0.232773 0.261671 0.282577 0.285803 0.272068 0.259006 0.260057 0.343167 0.338028 0.226010 0.224143 0.329444 0.347467 0.226629
chargesum: 0.00000
title: Mulliken charges with hydrogens summed into heavy atoms:
elementType: Cl N N N N N N C C C C C C C C C C C C C C C C C C
charge: -0.046073 -0.033021 0.003415 -0.010388 -0.061356 0.047352 0.063642 -0.020837 -0.148026 -0.044934 0.328628 0.055374 -0.124183 0.110044 0.305434 -0.109932 -0.128333 -0.070965 -0.081099 0.048963 0.044707 -0.109094 -0.005546 -0.007628 -0.006144
polarizability: 5.78084149e+02 -1.18975207e+01 2.46159101e+02 1.25010017e+00 8.28749329e+00 1.06177765e+02
1716.lowfreq: -3.6235 -0.4689 0.0009 0.0010 0.0013 6.0310 17.9698 41.6381 41.9012
frequency: 17.8927 41.6289 41.8984 56.1256 68.3847 96.4021 115.6100 132.2509 160.5330 187.4564 210.3729 224.7257 242.5065 280.3189 286.1568 300.0530 313.9807 348.3026 403.4452 406.4635 406.7611 429.2624 460.4518 465.2656 468.1774 480.4244 489.4246 519.3321 544.6873 548.2417 586.7078 603.3003 609.3588 616.4229 617.2191 626.6665 665.7168 671.6438 691.7612 700.8644 707.9215 717.0493 748.6963 761.2860 793.0277 798.7509 826.9872 837.3168 842.5903 866.7275 879.0154 957.9764 961.1849 975.3994 985.2146 990.3699 998.2892 1001.4827 1011.0466 1013.1003 1025.2478 1048.6616 1074.6350 1075.8463 1109.1707 1118.8956 1168.7553 1170.2170 1178.7991 1186.7986 1227.7011 1271.4728 1292.9095 1298.2035 1308.1523 1341.8049 1357.2565 1361.2655 1389.1967 1394.4777 1401.9696 1416.9891 1439.2047 1451.0817 1481.5040 1484.4980 1509.9872 1531.9324 1534.2712 1573.8352 1587.1359 1596.9875 1605.0038 1611.1003 1613.5632 3123.7887 3137.2139 3139.3146 3153.3409 3155.1628 3167.9564 3171.0350 3173.9881 3176.1969 3526.7071 3529.1315 3684.9205 3686.8177
redmass: 7.9738 4.3808 6.8128 4.6342 6.5808 5.5895 6.2132 7.1145 7.2279 8.6797 6.4175 5.7319 4.8789 7.2754 7.9945 5.2571 4.3663 4.6481 4.2442 2.8614 2.8402 5.0959 4.2571 5.6892 1.3922 3.0184 4.1650 2.9827 4.3035 1.6231 1.4542 6.3120 1.1131 5.9427 5.6873 6.1180 7.2647 9.0676 4.5269 5.9308 1.9008 3.5691 7.2777 5.4147 5.6719 2.9115 6.3680 1.3193 1.6016 1.2452 6.0434 1.4363 1.3555 1.4468 4.1137 5.9026 3.4543 1.3655 1.3334 3.0876 1.9902 2.4350 2.3811 1.6501 1.4228 3.6858 1.9680 1.0592 1.4574 1.1235 4.2544 6.6904 1.7185 2.0156 1.6556 8.5295 5.2156 5.3396 6.7565 6.5761 4.6321 5.4257 2.7309 3.9672 2.7449 2.8386 3.9489 3.5921 5.1015 7.4455 6.4074 6.1108 2.1469 1.3996 4.3845 1.0851 1.0897 1.0895 1.0950 1.0885 1.0945 1.0956 1.0981 1.0974 1.0441 1.0450 1.1046 1.1052
irintensity: 0.0999 0.3279 0.1276 0.3164 5.9266 1.5972 2.0032 0.7121 0.1444 1.0455 1.7844 2.5480 6.1675 0.9639 0.8269 1.7242 3.8633 1.6521 4.7392 0.2418 9.5360 1.6052 49.2604 10.2341 82.5199 55.4498 9.8720 12.4831 34.0273 170.1850 95.7044 8.2567 60.5818 0.8538 4.8834 6.5940 11.0688 13.3798 1.2787 3.7271 71.2889 12.4939 2.9919 22.2663 7.6388 24.5766 0.6114 5.3131 46.1302 0.0010 2.1318 5.5845 1.1823 18.6938 45.3672 26.0356 18.7545 0.0414 1.3210 2.8014 21.4180 2.4802 58.0678 27.3938 8.7148 9.7328 14.5275 0.1130 38.1447 2.8603 10.1054 39.9942 14.8196 7.0791 5.0643 96.8862 117.8828 222.2948 180.2622 9.1287 74.6749 161.7335 64.1815 177.1117 29.2822 123.2402 326.5062 371.7027 205.3221 0.4797 1.2459 54.0185 410.0810 183.2498 76.2178 0.0999 19.6515 3.6143 39.9730 2.2047 10.0727 4.2817 30.6495 2.3910 112.3137 76.3128 52.7302 57.6796
temp: 298.150 k
press: 1.00000 atm
elementType: 17 7 7 7 7 7 7 6 6 6 6 6 6 6 6 6 6 6 6 6 6 6 6 6 6 1 1 1 1 1 1 1 1 1 1 1 1 1
symmnumber: 1
zpe: 734948.2 jmol-1
zpe.correction: 0.279927 hartree
zpe.thermalcorrener: 0.300018 hartree
zpe.thermalcorrenthalpy: 0.300962 hartree
zpe.thermalcorrgfe: 0.229904 hartree
zpe.sumelectzpe: -1480.623775 hartree
zpe.sumelectthermal: -1480.603685 hartree
zpe.sumelectthermalent: -1480.602741 hartree
zpe.sumelectthermalfe: -1480.673798 hartree
dipole: -2.8849 -0.7750 -0.4997
dipole: 3.0287
quadrupole: -153.5313 -127.9882 -154.0714
quadrupole: -11.5927 2.1163 1.6282
quadrupole: -8.3343 17.2088 -8.8745 -11.5927 2.1163 1.6282
hfenergy: -1480.9037022 hartree
pointgroup: C01 [X(C18H13Cl1N6)]
dipole: -1.1326242 -0.2660767 -0.2573903 debye
polarizability: 578.3217759|-6.5529627|234.1111435|-4.7096538|39.7325936|117.9880957 unknown
InChI: InChI=1S/C18H13ClN6/c19-12-8-6-10(7-9-12)13-15(20)24-18-14(22-13)16(21)23-17(25-18)11-4-2-1-3-5-11/h1-9H,20-21H2
charge 0 multiplicity 1
38 atoms
Cl -8.050771 -0.746295 0.064386
N  -1.221924 -0.698932 -0.223223
N  -0.065504 1.874721 0.226652
N  2.105568 0.921875 0.134864
N  2.379007 -1.470881 -0.34659
N  -2.175477 2.836412 0.23614
N  0.510999 -2.870049 -0.654577
C  -2.020867 0.368161 -0.007557
C  0.137557 -0.513263 -0.20039
C  0.740221 0.768304 0.064829
C  -3.489782 0.136759 0.014371
C  -1.408309 1.692924 0.165415
C  2.856695 -0.196721 -0.075267
C  1.034289 -1.632551 -0.405307
C  4.33396 -0.045764 -0.006415
C  -4.060094 -0.800954 -0.889942
C  -4.344673 0.78011 0.953107
C  4.905917 1.225715 0.270638
C  5.186086 -1.163365 -0.215774
C  -5.442766 -1.073341 -0.883071
C  -5.730594 0.511036 0.97728
C  -6.261628 -0.406217 0.050301
C  6.305941 1.373904 0.337051
C  6.586416 -1.010876 -0.148765
C  7.151526 0.257233 0.127719
H  -3.403713 -1.313861 -1.599434
H  -3.926354 1.454539 1.708242
H  4.230056 2.071543 0.427956
H  4.727795 -2.133479 -0.427742
H  -5.876456 -1.787704 -1.588633
H  -6.38002 0.99613 1.71163
H  -3.179067 2.821649 0.07537
H  -1.677654 3.723743 0.300746
H  6.740646 2.35673 0.551007
H  7.238176 -1.876713 -0.311239
H  1.137145 -3.66147 -0.783638
H  -0.502513 -2.978507 -0.664737
H  8.240172 0.374554 0.179396
