program: Gaussian 09
title: 000241971
version: EM64L-G09RevD.01
frameworkgroup: C1[X(C6H8N2O2S)]
method: RPBEPBE
basis: SDD
operation: Freq
keyword: #p
keyword: freq=noraman
keyword: PBEPBE/SDD
title: #p freq=noraman PBEPBE/SDD
converged: YES YES NO NO
title: Mulliken charges:
elementType: S O O N N C C C C C C H H H H H H H H
charge: 0.654467 -0.664352 -0.564599 -0.399783 -0.313190 0.544796 -0.409618 -0.398494 -0.192975 -0.217865 -0.249756 0.225989 0.302411 0.334274 0.229755 0.228605 0.232209 0.294216 0.363910
chargesum: 0.00000
title: Mulliken charges with hydrogens summed into heavy atoms:
elementType: S O O N N C C C C C C
charge: 0.654467 -0.300442 -0.564599 -0.065509 -0.018974 0.544796 -0.183629 -0.096083 0.036779 0.010740 -0.017547
polarizability: 1.76618270e+02 5.85605315e+00 1.12553592e+02 -4.32814977e-01 -2.72420645e+00 7.43261330e+01
1716.lowfreq: -10.8388 -0.0012 0.0006 0.0025 3.9595 10.5860 56.0446 62.6103 91.0924
frequency: 55.9906 62.4855 91.0856 124.2813 152.8281 203.2523 241.9820 259.4344 280.0508 311.2545 377.9513 407.2145 476.9978 497.0885 516.2449 598.6890 612.3835 640.7153 692.1956 764.0981 793.2802 836.6339 876.2623 907.9655 916.3485 969.5205 983.7012 991.1521 995.4907 1024.5527 1093.5494 1155.1158 1173.7509 1195.2500 1256.8114 1326.5976 1364.7048 1395.8718 1449.6783 1482.8058 1530.0264 1604.6961 1609.0084 3121.2186 3122.5801 3138.9914 3150.3484 3169.9379 3270.2214 3512.9120 3535.2741
redmass: 4.3232 7.0968 5.7116 8.3463 6.7669 3.8177 4.4704 2.4101 2.2974 6.1177 5.5302 2.9086 4.3156 2.7785 8.9699 2.8776 5.3704 2.0606 1.9587 1.7379 4.2512 1.2589 7.0904 1.2842 1.3447 1.4962 2.7969 1.1940 1.4187 2.2641 1.5838 3.4345 1.0535 1.1394 2.0154 1.5452 1.9075 4.7472 2.1464 2.1732 1.3321 4.9698 4.9471 1.0883 1.0901 1.0900 1.0955 1.1011 1.0750 1.0672 1.0776
irintensity: 2.2895 2.3935 0.3130 10.5170 5.3661 39.7994 58.3211 18.2707 65.9134 23.2636 18.4616 0.0940 19.3709 16.7166 52.3033 8.7812 2.2317 9.8545 36.5645 82.1419 6.8557 1.0477 52.0663 26.9693 59.4299 0.1510 0.2798 37.9253 13.5423 4.5495 9.3347 27.9184 0.6389 1.7423 50.3865 50.3878 110.5015 23.1532 3.1499 49.4789 15.6310 14.9800 11.4645 6.6445 4.5476 1.2545 25.0361 28.2613 14.8372 22.8440 35.9381
temp: 298.150 k
press: 1.00000 atm
elementType: 16 8 8 7 7 6 6 6 6 6 6 1 1 1 1 1 1 1 1
symmnumber: 1
zpe: 360796.6 jmol-1
zpe.correction: 0.137420 hartree
zpe.thermalcorrener: 0.148958 hartree
zpe.thermalcorrenthalpy: 0.149902 hartree
zpe.thermalcorrgfe: 0.099402 hartree
zpe.sumelectzpe: -890.507400 hartree
zpe.sumelectthermal: -890.495862 hartree
zpe.sumelectthermalent: -890.494918 hartree
zpe.sumelectthermalfe: -890.545419 hartree
dipole: -1.4565 0.4858 -0.4971
dipole: 1.6138
quadrupole: -63.5714 -60.1511 -79.4845
quadrupole: 4.8586 -0.6329 1.3293
quadrupole: 4.1642 7.5846 -11.7488 4.8586 -0.6329 1.3293
hfenergy: -890.6448205 hartree
pointgroup: C01 [X(C6H8N2O2S1)]
dipole: -0.5714545 -0.2286392 0.1558784 debye
dipolederiv: -0.558789 0.0508204 0.4266602 0.3717202 0.9384582 -0.1902773 0.3500363 -0.1865679 0.4398569 -0.4716666 -0.0695309 -0.1703705 0.3684171 -0.9410811 0.0051549 -0.2083388 0.0338548 -0.2592929 0.0789694 0.109478 -0.2936676 -0.4605959 -0.4514336 0.2061168 0.1904319 0.1556623 -0.5847099 -1.0387373 0.0880773 0.4878854 0.3301938 -0.0718317 -0.3658382 -0.3414976 -0.0150323 0.1150099 0.9251887 -0.1897708 -0.5772758 -0.6705354 0.0156594 0.3855462 -0.2512798 -0.0176881 -0.3887047 0.756891 0.1072212 -0.0553814 0.4365502 0.0674503 0.021758 0.1503504 0.059568 0.0973283 -0.2975034 -0.0414548 0.0349948 -0.0167969 0.0783821 0.0546803 -0.0082549 0.0042357 -0.1570809 -0.1533879 -0.004023 0.0116195 -0.1706908 -0.133374 0.0033549 -0.0688336 0.040158 -0.1652188 0.1442476 -0.0443524 0.0409971 -0.1037814 0.0625493 0.0021212 0.0456208 0.0256991 -0.1123556 -0.0130502 -0.0254362 0.0499083 0.0725854 0.1636236 0.0432198 0.0552995 0.0554443 -0.1104894 -0.0668221 0.071697 0.0808716 0.0040699 -0.0978796 0.0502276 0.0278643 0.027354 -0.1504083 0.096167 -0.051974 -0.032435 -0.0175203 -0.0903359 -0.0507858 -0.0213754 -0.0569856 0.1384776 0.082687 0.0604114 -0.0386767 0.0251819 0.0826276 -0.0179694 -0.0130905 -0.0176502 0.1448082 0.1014328 0.0532605 0.0001785 -0.053128 0.1817913 0.0444982 -0.0117555 0.048244 0.216119 -0.0624264 0.0967311 -0.0328037 0.1100218 0.0205137 0.0039115 -0.0406971 0.0063194 0.1481881 0.0758156 0.0050245 -0.011975 -0.0386771 -0.1013595 -0.0423241 -0.0242898 -0.0504421 0.1386488 -0.07207 -0.0700009 -0.06888 -0.0762837 0.0583899 -0.0365468 -0.0720759 -0.0339068 0.1431163 0.1617316 -0.0976048 0.0473946 -0.0315781 -0.0103576 -0.0622272 0.1425947 -0.044855 0.2227507 0.3113223 -0.0485738 0.1009558 -0.0791525 0.2282076 -0.0546205 0.099291 -0.0334115 0.123957 unknown
polarizability: 176.2904098|-6.3791395|111.4171252|-4.209554|7.6614836|75.7904602 unknown
InChI: InChI=1S/C6H7N2.HO2S/c7-8-6-4-2-1-3-5-6;1-3-2/h1-5,7-8H;1H
charge 0 multiplicity 1
19 atoms
S  3.067985 0.139085 -0.42641
O  2.526259 -1.674114 -0.263721
O  1.986274 0.948597 -1.349172
N  0.675402 1.109995 0.943721
N  1.782649 0.551358 1.480561
C  -0.513854 0.491875 0.444863
C  -1.655198 1.315427 0.264253
C  -0.580146 -0.900369 0.185234
C  -2.868841 0.742153 -0.164377
C  -1.806779 -1.458533 -0.230595
C  -2.954553 -0.649414 -0.405302
H  -1.593337 2.392502 0.463613
H  0.321912 -1.520997 0.241928
H  0.726254 2.12964 0.878585
H  -3.747962 1.380303 -0.304499
H  -1.86032 -2.532313 -0.441526
H  -3.899056 -1.094698 -0.73463
H  1.606091 -0.470556 1.632991
H  2.817018 -2.170941 -1.078115
