program: Gaussian 09
title: 000241983
version: EM64L-G09RevD.01
frameworkgroup: C1[X(C19H16N6O)]
method: RPBEPBE
basis: SDD
operation: Freq
keyword: #p
keyword: freq=noraman
keyword: PBEPBE/SDD
title: #p freq=noraman PBEPBE/SDD
converged: YES YES NO NO
title: Mulliken charges:
elementType: O N N N N N N C C C C C C C C C C C C C C C C C C C H H H H H H H H H H H H H H H H
charge: -0.260734 -0.037048 0.002410 -0.011922 -0.063120 -0.633757 -0.615542 -0.022176 0.318307 -0.145195 -0.047391 0.045751 0.106042 -0.125408 -0.388538 -0.396835 0.305777 -0.354464 -0.359981 0.323180 -0.358620 -0.355456 -0.232345 -0.232505 -0.234480 -0.537086 0.253935 0.278156 0.243577 0.255758 0.285804 0.271714 0.334930 0.344357 0.346442 0.326502 0.224688 0.222663 0.225201 0.224575 0.249175 0.223657
chargesum: 0.00000
title: Mulliken charges with hydrogens summed into heavy atoms:
elementType: O N N N N N N C C C C C C C C C C C C C C C C C C C
charge: -0.260734 -0.037048 0.002410 -0.011922 -0.063120 0.045530 0.057402 -0.022176 0.318307 -0.145195 -0.047391 0.045751 0.106042 -0.125408 -0.134603 -0.118680 0.305777 -0.110887 -0.104222 0.323180 -0.072816 -0.083742 -0.007657 -0.009842 -0.009279 0.160320
polarizability: 5.90553401e+02 -1.10296438e+01 2.56199560e+02 9.19892457e-01 5.50740601e+00 1.14336586e+02
1716.lowfreq: -2.9737 -0.0010 -0.0008 0.0009 4.4194 4.8103 18.6247 37.3837 42.7072
frequency: 18.4870 37.3826 42.6932 58.5005 67.4978 88.2654 109.8468 116.2388 142.3159 171.7450 195.3438 203.0783 223.1228 232.5217 247.1735 276.8001 286.7765 307.8485 316.6315 354.5600 406.7449 412.0308 418.3775 432.4114 456.6731 469.5203 474.6950 481.5173 487.2577 526.8471 540.3102 547.2069 563.2271 584.9797 607.6733 611.2269 616.8217 629.3273 635.5172 666.1544 671.1888 692.0030 708.0938 724.8239 748.6476 756.1815 764.6374 797.9174 801.7802 823.2111 827.4192 846.5980 866.7320 879.5766 951.4576 956.9735 976.6941 981.0953 987.4450 990.4632 998.7149 1001.2206 1010.5243 1019.1755 1025.2949 1049.5938 1075.0323 1112.5938 1113.5029 1119.0104 1157.4606 1168.3951 1169.5521 1177.9707 1179.4724 1227.4741 1236.6768 1272.5609 1296.8644 1303.6750 1308.7671 1341.2405 1359.6217 1362.0508 1390.3190 1399.1261 1417.6994 1424.0287 1436.0092 1441.0234 1452.8209 1469.1953 1471.7616 1484.1947 1501.1016 1511.1910 1529.6100 1534.8921 1570.6719 1587.5121 1602.8065 1608.8861 1612.9742 1619.5089 2964.7846 3054.9944 3122.4709 3129.7324 3134.8248 3135.9190 3147.4171 3152.4053 3167.2667 3167.6320 3170.9261 3173.2556 3526.0008 3529.0479 3685.2245 3687.8584
redmass: 5.8766 4.3149 4.1632 4.4115 5.8554 4.4564 4.6744 5.0439 5.7062 5.1522 4.5094 5.3343 3.6762 1.7689 2.6301 4.0903 7.2500 4.3757 5.1226 4.4206 2.8801 2.6099 4.7033 4.9897 4.0535 1.5586 2.6307 3.0540 4.6481 2.5880 1.8761 3.0892 6.7780 1.4757 5.2160 1.0836 6.3511 6.6824 5.8228 6.9679 9.2940 4.6323 1.7114 3.9169 7.4062 6.5937 5.5753 2.8279 5.3812 1.6322 4.1817 1.5995 1.2454 6.0557 1.3703 1.4368 1.4480 5.9844 4.8604 5.5031 2.9634 1.3630 1.3326 2.3951 1.9880 2.4545 1.5514 1.2680 1.4744 3.2709 1.3382 1.9276 1.0580 1.4132 1.2958 3.5941 3.3222 6.6384 3.1231 1.3166 1.7403 8.2910 5.2594 5.2837 8.8238 6.8496 5.4450 4.1153 1.4171 2.0153 4.0519 1.0496 1.0718 2.7620 2.8639 3.6906 3.5548 4.9514 7.1032 6.4176 2.0342 1.4126 5.1643 6.1527 1.0328 1.1042 1.0850 1.0997 1.0891 1.0897 1.0877 1.0951 1.0945 1.0950 1.0960 1.0980 1.0441 1.0448 1.1049 1.1051
irintensity: 0.0491 0.4385 0.0886 0.2718 2.1479 6.6626 4.2691 0.5113 1.9546 1.3866 1.7362 3.6143 3.0648 1.8716 2.9349 4.7121 0.9188 2.8164 3.4619 3.7643 0.0585 10.2399 0.0361 1.4750 11.1595 120.6594 7.3201 52.6910 5.6033 20.1205 148.1726 56.5164 18.3121 82.2266 6.9416 54.8692 0.3469 8.4260 17.5585 10.7342 11.7665 0.7126 78.2815 8.6431 2.5234 0.2702 22.7683 18.5635 10.3750 12.5156 2.6282 48.0285 0.0013 3.3747 0.4707 5.6669 8.5093 88.7731 6.8187 3.6925 2.6307 0.0684 1.4189 7.1518 22.0105 6.5340 14.9226 0.7148 10.2012 7.9332 2.2769 22.2840 0.1242 0.1670 203.7630 3.1292 266.2913 39.1953 37.5370 8.6347 19.1894 87.9452 223.0499 125.3908 165.1379 29.5040 176.9065 8.1374 76.5588 19.2931 184.4265 14.4590 64.9141 45.8951 192.0811 215.0298 291.7404 168.5348 19.5924 1.8912 442.3517 159.8897 49.2382 213.1214 82.3969 44.4752 0.1911 28.2983 5.1677 20.7822 7.3890 42.1554 10.4918 10.1444 11.2393 29.7776 98.3401 81.6966 54.6026 57.4538
temp: 298.150 k
press: 1.00000 atm
elementType: 8 7 7 7 7 7 7 6 6 6 6 6 6 6 6 6 6 6 6 6 6 6 6 6 6 6 1 1 1 1 1 1 1 1 1 1 1 1 1 1 1 1
symmnumber: 1
zpe: 842887.7 jmol-1
zpe.correction: 0.321039 hartree
zpe.thermalcorrener: 0.342518 hartree
zpe.thermalcorrenthalpy: 0.343462 hartree
zpe.thermalcorrgfe: 0.269817 hartree
zpe.sumelectzpe: -1135.586897 hartree
zpe.sumelectthermal: -1135.565419 hartree
zpe.sumelectthermalent: -1135.564474 hartree
zpe.sumelectthermalfe: -1135.638119 hartree
dipole: -6.6360 -2.4275 -1.1532
dipole: 7.1596
quadrupole: -121.8486 -127.0342 -154.7576
quadrupole: 3.2522 8.1197 1.0678
quadrupole: 12.6982 7.5126 -20.2108 3.2522 8.1197 1.0678
hfenergy: -1135.9079363 hartree
pointgroup: C01 [X(C19H16N6O1)]
dipole: -2.6076183 -0.771639 -0.7343232 debye
polarizability: 590.4880932|-12.2645836|240.9679532|1.3749848|44.2653481|129.6335008 unknown
InChI: InChI=1S/C19H16N6O/c1-26-13-9-7-11(8-10-13)14-16(20)24-19-15(22-14)17(21)23-18(25-19)12-5-3-2-4-6-12/h2-10H,20-21H2,1H3
charge 0 multiplicity 1
42 atoms
O  -7.372048 -0.246151 0.157193
N  -0.925387 -0.581436 -0.226621
N  0.314859 1.938608 0.308772
N  2.455493 0.921998 0.167199
N  2.650439 -1.458755 -0.400788
N  -1.765692 2.961476 0.364002
N  0.73417 -2.784755 -0.746554
C  -1.690717 0.500974 0.031544
C  -3.165361 0.325799 0.046092
C  0.441113 -0.436501 -0.206043
C  1.084437 0.813644 0.101191
C  -1.032696 1.799171 0.249295
C  1.300474 -1.574296 -0.456678
C  3.169295 -0.2107 -0.087292
C  -3.776214 -0.550443 -0.888412
C  -4.001281 0.963732 1.010619
C  4.65192 -0.108386 -0.023107
C  -5.168441 -0.76997 -0.894801
C  -5.389246 0.747535 1.022943
C  -5.982313 -0.112621 0.063558
C  5.264936 1.134572 0.292036
C  5.467957 -1.243801 -0.274855
C  6.669356 1.237523 0.353717
C  6.872949 -1.136857 -0.212322
C  7.479042 0.103187 0.101868
C  -8.038391 -1.140246 -0.795489
H  -3.139039 -1.059616 -1.618689
H  -3.557782 1.589117 1.793527
H  -5.603576 -1.442906 -1.639468
H  -6.031982 1.220013 1.771712
H  4.616011 1.994729 0.481965
H  4.978114 -2.191611 -0.515528
H  -1.24326 3.831611 0.458207
H  -2.771738 2.976455 0.219267
H  -0.28282 -2.855129 -0.752183
H  1.331657 -3.592067 -0.907162
H  7.135326 2.199044 0.59709
H  7.49648 -2.016763 -0.407484
H  8.571139 0.185103 0.150049
H  -7.673643 -2.180287 -0.692256
H  -9.10508 -1.093345 -0.53298
H  -7.894463 -0.795249 -1.837535
