program: Gaussian 09
title: 000226372
version: EM64L-G09RevD.01
frameworkgroup: C1[X(C17H24ClNO4)]
method: RPBEPBE
basis: SDD
operation: Freq
keyword: #p
keyword: freq=noraman
keyword: PBEPBE/SDD
title: #p freq=noraman PBEPBE/SDD
converged: YES YES NO NO
title: Mulliken charges:
elementType: Cl O O O O N C C C C C C C C C C C C C C C C C H H H H H H H H H H H H H H H H H H H H H H H H
charge: -0.080171 -0.275369 -0.452222 -0.283806 -0.210220 -0.408908 -0.410363 -0.014426 -0.145447 -0.709452 -0.714934 -0.539502 0.251345 0.133687 -0.401183 -0.293640 0.228717 0.331623 -0.339626 -0.373515 -0.785846 -0.239384 -0.100631 0.237920 0.246306 0.203545 0.292694 0.214628 0.219678 0.209940 0.220553 0.216028 0.216946 0.343341 0.230143 0.215944 0.227943 0.219808 0.197269 0.262498 0.392677 0.261738 0.258372 0.237931 0.239276 0.215997 0.252097
chargesum: 0.00000
title: Mulliken charges with hydrogens summed into heavy atoms:
elementType: Cl O O O O N C C C C C C C C C C C C C C C C C
charge: -0.080171 -0.275369 -0.059545 -0.283806 -0.210220 -0.065567 0.073864 0.189119 0.147246 -0.065206 -0.061408 -0.093416 0.251345 0.133687 0.046569 0.166128 0.228717 0.331623 -0.077888 -0.115143 -0.092642 0.012713 -0.100631
polarizability: 2.87042769e+02 -2.45510343e+01 1.61639149e+02 1.43525529e+01 -6.88309895e+00 1.98950992e+02
1716.lowfreq: -1.2682 0.0018 0.0019 0.0019 4.5138 8.5620 13.3361 17.9445 22.3021
frequency: 10.6215 17.8193 22.1297 35.8920 39.0972 52.3985 69.6062 72.8854 86.3466 98.8127 115.8884 127.8919 132.0243 148.5000 175.2436 192.6534 195.7262 211.5256 215.7448 227.3446 242.8054 255.4306 269.6652 285.8025 325.5258 335.2904 342.5529 377.2261 381.6899 414.7045 427.4994 443.8238 492.9287 496.9071 513.6830 528.4659 546.6539 549.3497 589.8122 601.3601 639.8808 642.3500 705.8503 713.1391 729.2606 754.3097 761.3758 801.6096 818.0280 837.0625 854.0385 864.5448 875.1034 891.1420 913.6580 919.1138 927.2800 939.5891 960.3533 975.4432 986.3404 993.2501 1022.4167 1046.2589 1054.6165 1069.2749 1087.3642 1095.6049 1125.0330 1126.4428 1127.9086 1157.1017 1168.3093 1176.9455 1188.5253 1201.0013 1232.5136 1237.9221 1243.0795 1250.6901 1269.0528 1285.5881 1287.9246 1304.6972 1312.9595 1317.3568 1344.8441 1349.4870 1360.2778 1373.5729 1380.0494 1389.6400 1395.3743 1398.4075 1400.5736 1450.4878 1456.2134 1456.9844 1469.1685 1470.0600 1471.3019 1472.5779 1475.9774 1480.9003 1483.6175 1493.1598 1494.3376 1588.8018 1599.1159 1600.6201 1675.7238 2964.9137 2967.7946 2969.8853 2973.6022 2980.8780 2983.4411 2988.6784 3000.4023 3001.3308 3046.3775 3052.0989 3061.5373 3062.1275 3063.6588 3068.4827 3073.2871 3074.1813 3074.8996 3093.7069 3155.7171 3158.8529 3178.0818 3526.2934 3555.2007
redmass: 5.3745 4.8753 4.5976 4.6710 3.9824 4.4192 6.0835 6.6268 5.9433 4.2559 1.1165 3.4668 4.7278 2.8212 2.8425 2.8856 2.8252 2.1752 1.7310 2.4105 1.5422 3.6715 2.9246 4.1800 4.4424 6.5034 3.4650 2.3024 4.2852 1.9353 4.5619 2.9391 3.1361 3.4918 3.1871 4.1789 3.4733 4.2274 1.1719 3.0669 5.9138 1.7785 3.5687 3.4782 4.5370 3.1785 3.9816 1.4694 2.0801 1.9456 3.3793 2.4150 1.3375 1.8988 2.8478 1.2229 1.3544 2.0525 1.5727 4.9275 2.2455 1.5700 2.5262 1.5161 2.0087 1.8390 1.9205 2.4339 3.2759 1.9976 2.0676 2.0846 1.2690 1.8141 2.1664 1.4167 1.2528 3.4412 1.3666 1.3795 1.3018 1.1817 1.6035 1.3246 1.3389 1.5919 1.4024 1.4801 1.5296 3.7913 1.2138 1.7202 2.7835 1.2095 1.3246 1.1174 1.0457 1.0829 1.4098 1.1653 1.1534 1.0671 1.5305 1.4306 1.1932 1.2116 1.0581 7.3958 6.2178 6.6859 9.1522 1.0629 1.0827 1.0353 1.0360 1.0792 1.0364 1.0596 1.0627 1.0612 1.0990 1.1005 1.0968 1.1013 1.1002 1.0996 1.0993 1.0992 1.1045 1.1003 1.0925 1.0880 1.0967 1.0644 1.0782
irintensity: 0.1014 0.1829 0.1566 0.1796 1.2263 2.4186 4.6903 0.0822 3.9331 0.1043 0.0358 1.9023 2.0264 8.4272 0.1499 7.6164 1.6561 0.9586 1.4029 2.2057 0.7519 1.6017 7.5954 2.2817 3.2288 0.0372 1.1989 0.7512 3.6566 1.3902 6.9508 4.7394 22.9713 10.2253 28.4675 32.2806 6.0308 2.4008 49.3097 26.1073 38.1657 178.6866 17.4268 0.4131 2.1304 0.3028 17.1166 53.1714 3.9930 5.3172 28.0406 8.8062 18.1886 17.2706 5.0774 11.3619 0.6903 48.5805 7.7345 69.0650 28.7747 12.8994 9.3802 7.4173 183.9934 44.1934 4.4664 0.1089 41.0128 89.8067 5.4820 17.5977 2.1400 10.1710 144.0243 41.8850 7.4894 126.2045 1.7407 2.4536 4.3138 2.0424 26.4958 5.1973 3.3553 5.7726 13.1026 10.3782 6.1473 4.6438 18.1903 18.5981 11.8555 17.2774 16.0684 29.8214 13.1909 5.2151 50.1659 41.3196 31.5840 19.8479 362.9615 42.4273 68.6687 13.2760 42.0121 1.1859 140.3544 14.4093 214.0449 27.8597 20.2222 35.0274 24.1035 14.5174 25.5893 24.3589 26.3638 15.7139 10.1423 19.3148 16.3708 3.2930 7.0221 34.3494 74.9909 69.8796 25.8449 23.2518 4.9200 5.6760 4.5237 35.6351 61.4805
temp: 298.150 k
press: 1.00000 atm
elementType: 17 8 8 8 8 7 6 6 6 6 6 6 6 6 6 6 6 6 6 6 6 6 6 1 1 1 1 1 1 1 1 1 1 1 1 1 1 1 1 1 1 1 1 1 1 1 1
symmnumber: 1
zpe: 1005864.1 jmol-1
zpe.correction: 0.383113 hartree
zpe.thermalcorrener: 0.408651 hartree
zpe.thermalcorrenthalpy: 0.409595 hartree
zpe.thermalcorrgfe: 0.323345 hartree
zpe.sumelectzpe: -1476.173127 hartree
zpe.sumelectthermal: -1476.147590 hartree
zpe.sumelectthermalent: -1476.146645 hartree
zpe.sumelectthermalfe: -1476.232895 hartree
dipole: 5.4342 -2.5782 3.7990
dipole: 7.1141
quadrupole: -162.8089 -139.1877 -145.1239
quadrupole: -7.3048 5.4892 0.2234
quadrupole: -13.7687 9.8524 3.9163 -7.3048 5.4892 0.2234
hfenergy: -1476.5562403 hartree
pointgroup: C01 [X(C17H24Cl1N1O4)]
dipole: -2.3150053 0.2679991 1.5501012 debye
polarizability: 291.6856885|6.8690281|157.127167|-14.0882214|-3.4850077|198.8200534 unknown
InChI: InChI=1S/C17H24ClNO4/c1-11(2)9-14(17(21)22)19-16(20)5-4-8-23-15-7-6-13(18)10-12(15)3/h6-7,10-11,14,19,21H,4-5,8-9H2,1-3H3
charge 0 multiplicity 1
47 atoms
Cl 7.927948 1.188542 -1.351813
O  2.470065 1.203715 1.207607
O  -5.630782 0.395107 -0.024384
O  -1.075124 0.810537 -1.387529
O  -5.916926 -0.924292 -1.915334
N  -3.017913 0.485952 -0.166028
C  -3.047388 -1.79607 -1.291589
C  -2.957984 -2.579682 0.041703
C  -3.628216 -0.344191 -1.214983
C  -2.189878 -3.902072 -0.201256
C  -4.338922 -2.867707 0.679492
C  -1.25753 1.922585 0.802681
C  -1.762346 1.035253 -0.338025
C  -5.149108 -0.346317 -1.121842
C  0.0886 1.437453 1.404305
C  1.262957 1.541455 0.42468
C  3.705745 1.214265 0.540997
C  4.83458 0.901829 1.358136
C  3.859962 1.51018 -0.834705
C  6.112994 0.899339 0.757977
C  4.64592 0.586196 2.827001
C  5.147668 1.50301 -1.420227
C  6.254108 1.198655 -0.612687
H  -3.660271 -2.359324 -2.022102
H  -2.031653 -1.696098 -1.715259
H  -2.365841 -1.969128 0.755501
H  -3.380918 0.121091 -2.192237
H  -2.062303 -4.464699 0.741988
H  -1.185921 -3.713717 -0.624655
H  -2.740175 -4.551498 -0.909115
H  -4.991684 -3.415233 -0.026751
H  -4.222853 -3.491282 1.585278
H  -4.86313 -1.942966 0.982753
H  -3.590352 0.725449 0.645475
H  -1.123618 2.943493 0.393839
H  -2.011087 1.991085 1.609531
H  0.322706 2.057271 2.29015
H  -0.000921 0.392317 1.755427
H  1.356161 2.573978 0.02735
H  1.142494 0.84582 -0.424486
H  -6.625208 0.368105 -0.018335
H  2.996391 1.742435 -1.463624
H  6.994433 0.664023 1.362468
H  4.167295 1.431131 3.355393
H  3.976241 -0.282904 2.962232
H  5.611076 0.367027 3.313882
H  5.275009 1.72958 -2.48248
