program: Gaussian 09
title: 000226360
version: EM64L-G09RevD.01
frameworkgroup: C1[X(C19H20O6)]
method: RPBEPBE
basis: SDD
operation: Freq
keyword: #pfreq=noraman
keyword: PBEPBE/SDD
title: #p freq=noraman PBEPBE/SDD
converged: YES YES NO NO
title: Mulliken charges:
elementType: O O O O O O C C C C C C C C C C C C C C C C C C C H H H H H H H H H H H H H H H H H H H H
charge: -0.254706 -0.279207 -0.287710 -0.288337 -0.227195 -0.229199 0.225952 0.251539 0.194661 0.205052 0.349297 0.348952 -0.461537 -0.464257 -0.313169 -0.320548 -0.400309 -0.399730 -0.272814 0.116953 0.118015 -0.788266 -0.788440 -0.519368 -0.519177 0.269099 0.268674 0.269747 0.245835 0.281347 0.280545 0.258629 0.224402 0.261948 0.238297 0.240830 0.261339 0.240171 0.238342 0.235451 0.216804 0.259132 0.235611 0.265399 0.211945
chargesum: 0.00000
title: Mulliken charges with hydrogens summed into heavy atoms:
elementType: O O O O O O C C C C C C C C C C C C C C C C C C C
charge: -0.254706 -0.279207 -0.287710 -0.288337 -0.227195 -0.229199 0.225952 0.251539 0.194661 0.205052 0.349297 0.348952 -0.192437 -0.195583 -0.043422 -0.074713 -0.118962 -0.119186 0.210217 0.116953 0.118015 -0.047190 -0.048588 0.192019 0.193778
polarizability: 3.61821564e+02 4.84878634e+00 2.13120566e+02 -2.09655700e+01 -6.88010064e+00 1.71081618e+02
1716.lowfreq: -7.9417 -5.4339 -3.5364 -0.0011 -0.0006 0.0002 8.4425 15.3144 21.7695
frequency: 8.0473 15.2531 21.7648 47.7589 53.0218 54.4785 65.3746 73.1217 81.7554 108.3554 126.0676 128.1686 133.4277 145.3064 152.2416 161.6811 163.9770 166.7638 200.4498 200.7229 235.3718 272.8831 292.4762 304.9494 323.4726 338.6323 349.5779 359.5672 385.7622 393.3878 440.4677 457.2207 465.6367 489.6081 510.0660 521.6099 530.0537 573.1689 576.3445 590.4554 615.8297 649.7353 652.7950 663.5319 675.0523 712.9873 732.6687 738.6929 763.2517 817.2601 833.3023 850.7189 852.0440 898.1661 898.4986 916.0714 948.2837 948.7941 966.8651 972.2091 982.1003 984.1038 1025.7087 1026.0390 1032.6177 1066.1185 1074.1237 1092.3699 1107.3582 1109.4349 1111.1721 1122.2227 1153.2016 1155.5209 1168.8007 1186.4483 1219.7185 1228.6343 1238.4157 1256.4160 1263.5033 1293.3576 1297.9021 1366.3191 1368.6434 1373.0168 1381.5994 1383.8966 1394.3193 1398.5980 1437.9833 1438.7713 1447.4611 1449.1897 1456.7928 1457.3671 1461.6071 1462.0192 1472.1700 1477.6939 1480.5880 1488.4323 1494.8044 1561.0512 1564.9689 1594.3534 1598.2315 1610.1195 1611.9523 2964.2412 2979.7936 2981.9073 2985.4643 2985.5084 3069.6988 3069.8947 3076.2421 3090.5130 3091.8420 3125.6721 3125.9682 3132.5499 3132.9111 3145.9031 3153.1752 3165.7246 3167.3932 3169.0085 3172.0524
redmass: 5.6102 4.8442 4.8627 2.2265 3.8047 3.8306 2.3244 5.7913 5.1471 5.5050 3.1192 1.7269 2.4012 1.1305 3.4791 1.1255 3.0428 2.5957 3.5684 3.0129 3.0505 4.1101 3.5338 6.1383 6.8927 5.4324 5.2007 5.1870 4.4803 4.7517 3.9724 3.7741 3.5382 4.2219 4.7958 3.5872 3.9031 5.2178 5.0211 4.5801 4.5658 3.2557 3.3503 4.9731 5.9399 5.3757 3.6174 3.6096 6.4724 1.4080 1.3986 6.5782 6.3693 1.4952 1.5073 9.3668 2.2375 2.1976 1.3337 1.3355 4.7541 4.8393 1.8384 1.8367 6.1663 2.1937 2.0208 1.5412 1.2702 2.1652 1.3356 2.0627 1.3502 1.3378 1.6494 2.1369 2.0266 1.4753 1.5649 1.9973 1.9755 2.5799 2.9525 1.6406 1.3598 1.7297 4.5818 1.8582 3.4330 3.1302 1.3200 1.3153 1.0942 1.0977 1.0626 1.0611 1.0500 1.0497 1.1589 1.0600 1.0551 2.8556 2.4986 7.3575 7.4696 7.1643 7.3511 7.3780 7.0742 1.0601 1.0351 1.0339 1.0376 1.0375 1.0968 1.0968 1.1048 1.0986 1.0970 1.0993 1.0992 1.1048 1.1046 1.0878 1.0877 1.0920 1.0914 1.0953 1.0962
irintensity: 0.6193 0.3003 1.1346 2.7261 2.8224 7.5386 3.6856 2.1449 0.9914 4.7475 1.2263 2.9541 3.4632 2.3421 5.4759 0.4929 1.1612 1.1233 7.1902 5.8443 9.4930 1.5932 4.8688 2.4366 1.2393 4.0715 2.2925 0.9472 12.2489 6.9139 1.4169 2.3081 3.6741 3.0304 2.1985 0.9906 1.6564 29.8211 37.4275 1.4698 6.7225 6.3922 4.9970 0.7149 1.3005 14.1194 4.5589 6.9890 10.0109 33.6834 35.9349 2.1371 12.9046 24.1044 26.8230 577.9039 44.0735 41.7141 2.6514 4.3281 51.4485 30.9221 1.1664 1.0936 189.2784 102.5764 25.4217 32.8682 21.5419 217.5258 47.2363 86.4315 20.7891 12.8563 126.3525 53.8902 69.1353 49.9255 21.3982 527.5291 102.2115 437.0663 156.1955 51.5587 48.9838 26.2207 20.8486 40.8630 11.7999 9.8310 3.1533 4.4687 39.3387 43.4186 12.7001 11.2385 21.1155 20.6541 21.7064 24.9972 26.4575 70.2625 28.6134 180.7788 189.7684 131.7926 28.5834 67.8746 34.9831 36.9097 60.5034 72.1915 2.9757 3.2151 11.5300 11.7040 17.6472 30.8688 31.5721 19.9766 16.7857 18.4343 17.2239 11.6991 1.7325 6.5944 5.0334 5.6576 5.2136
temp: 298.150 k
press: 1.00000 atm
elementType: 8 8 8 8 8 8 6 6 6 6 6 6 6 6 6 6 6 6 6 6 6 6 6 6 6 1 1 1 1 1 1 1 1 1 1 1 1 1 1 1 1 1 1 1 1
symmnumber: 1
zpe: 914173.7 jmol-1
zpe.correction: 0.348190 hartree
zpe.thermalcorrener: 0.374061 hartree
zpe.thermalcorrenthalpy: 0.375006 hartree
zpe.thermalcorrgfe: 0.288119 hartree
zpe.sumelectzpe: -1185.469282 hartree
zpe.sumelectthermal: -1185.443411 hartree
zpe.sumelectthermalent: -1185.442467 hartree
zpe.sumelectthermalfe: -1185.529354 hartree
dipole: -1.9901 2.2067 2.1081
dipole: 3.6433
quadrupole: -167.8075 -152.1908 -147.1569
quadrupole: -17.3923 6.2461 -4.5131
quadrupole: -12.0891 3.5276 8.5615 -17.3923 6.2461 -4.5131
hfenergy: -1185.8174726 hartree
pointgroup: C01 [X(C19H20O6)]
dipole: 0.7457759 0.6726138 -1.0227611 debye
polarizability: 361.0325069|-6.8856972|213.714565|-24.0325318|-3.2331163|171.2766764 unknown
InChI: InChI=1S/C19H20O6/c1-12(20)14-5-7-16(18(9-14)22-3)24-11-25-17-8-6-15(13(2)21)10-19(17)23-4/h5-10H,11H2,1-4H3
charge 0 multiplicity 1
45 atoms
O  1.131398 1.741208 -0.263514
O  -0.858118 0.517036 -0.440124
O  3.795584 2.467545 -0.924817
O  -2.363228 -1.239155 -2.113101
O  5.238553 -3.082598 1.098972
O  -6.942933 -0.061695 1.702134
C  2.156494 0.782386 -0.074064
C  -2.193467 0.240245 -0.096512
C  3.473808 1.190936 -0.441731
C  -2.898972 -0.662364 -0.953271
C  4.340557 -0.977579 0.352677
C  -4.932095 -0.337543 0.40801
C  4.547309 0.30573 -0.214869
C  -4.256666 -0.930879 -0.689753
C  1.933437 -0.510192 0.458986
C  -2.856141 0.818641 1.016912
C  3.017711 -1.377705 0.677788
C  -4.210447 0.534575 1.263417
C  -0.135412 1.520789 0.360671
C  5.468156 -1.93619 0.610513
C  -6.379981 -0.602544 0.703599
C  6.892474 -1.506062 0.275212
C  -7.161804 -1.532743 -0.218368
C  3.062388 2.96931 -2.109485
C  -1.041498 -1.900696 -2.041047
H  5.545406 0.659849 -0.488974
H  -4.764791 -1.614238 -1.376458
H  0.916339 -0.839871 0.689059
H  -2.325499 1.501911 1.687475
H  2.867034 -2.377374 1.09704
H  -4.737473 0.979553 2.113136
H  -0.662843 2.489051 0.319298
H  -0.016989 1.15806 1.402901
H  7.584766 -2.318568 0.542066
H  6.996381 -1.282602 -0.803144
H  7.173898 -0.591886 0.83028
H  -8.20142 -1.598392 0.136023
H  -7.155711 -1.159782 -1.25946
H  -6.718626 -2.546204 -0.228175
H  3.52262 3.943958 -2.329856
H  3.204952 2.283362 -2.966259
H  1.988629 3.086739 -1.893654
H  -0.921523 -2.384948 -3.021699
H  -0.236718 -1.169136 -1.869775
H  -1.03584 -2.667437 -1.242459
