program: Gaussian 09
title: 000226357
version: EM64L-G09RevD.01
frameworkgroup: C1[X(C18H22O6)]
method: RPBEPBE
basis: SDD
operation: Freq
keyword: #pfreq=noraman
keyword: PBEPBE/SDD
title: #p freq=noraman PBEPBE/SDD
converged: YES YES NO NO
title: Mulliken charges:
elementType: O O O O O O C C C C C C C C C C C C C C C C C C H H H H H H H H H H H H H H H H H H H H H H
charge: -0.431582 -0.429943 -0.245673 -0.334064 -0.407764 -0.430912 -0.349911 -0.358752 0.577962 0.582754 -0.450954 -0.429212 -0.484981 -0.482419 0.229924 0.236154 -0.365744 -0.334821 0.111848 0.088485 -0.246371 -0.234156 -0.686132 -0.687595 0.215091 0.216879 0.301221 0.293012 0.221115 0.219402 0.338180 0.336229 0.216575 0.248230 0.223324 0.212517 0.240177 0.212127 0.351651 0.378394 0.207673 0.231509 0.228609 0.213373 0.226458 0.232114
chargesum: 0.00000
title: Mulliken charges with hydrogens summed into heavy atoms:
elementType: O O O O O O C C C C C C C C C C C C C C C C C C
charge: -0.093402 -0.093715 -0.245673 -0.334064 -0.056114 -0.052518 -0.134819 -0.141873 0.577962 0.582754 -0.149733 -0.136200 -0.263866 -0.263017 0.229924 0.236154 -0.149168 -0.086591 0.111848 0.088485 0.189470 0.218147 -0.018342 -0.015649
polarizability: 2.06694166e+02 7.22201819e+00 2.52643631e+02 4.66970916e+01 -6.05249335e+00 1.88542689e+02
1716.lowfreq: -6.7160 -5.9751 -0.0001 0.0004 0.0008 4.2934 9.2223 16.0462 19.4639
frequency: 8.4134 15.6278 19.4540 61.3036 63.3443 68.0796 79.9315 96.4294 101.9661 108.5271 110.9081 146.1536 167.6580 188.7413 196.7386 221.1359 235.2458 240.8051 250.8240 266.6283 282.3343 285.9718 290.6134 312.2616 318.8297 326.6718 340.6016 347.0989 366.8905 398.6100 442.1083 448.4780 455.6705 489.6268 505.0934 510.6943 518.8458 552.5145 566.3808 586.1377 598.7272 624.1355 677.5086 685.3103 719.0575 728.9345 753.4553 777.8506 785.6434 802.9560 818.4493 824.7578 827.6295 852.4518 873.2165 877.3521 900.2631 903.8012 922.1730 930.7291 976.1566 985.2801 992.5340 1002.7006 1031.2003 1037.8530 1085.2666 1109.3184 1114.8759 1115.7414 1132.2843 1134.2564 1140.8900 1144.9534 1162.4649 1176.8259 1185.9137 1198.8362 1219.0728 1234.3539 1246.1565 1261.1807 1265.0485 1267.2284 1268.6247 1289.1708 1294.6942 1309.0498 1366.9702 1374.6802 1385.1906 1395.8276 1399.5091 1401.1096 1411.4016 1424.7334 1430.9906 1433.3938 1460.0421 1462.6544 1476.0696 1477.5606 1487.7829 1489.8233 1507.9708 1512.8352 1604.3027 1611.2430 1615.8014 1621.1719 2890.0493 2900.8629 2958.9169 2969.6573 2996.1037 2996.5765 3018.1479 3030.3184 3093.9815 3094.1505 3103.7704 3105.3122 3109.8948 3125.4091 3139.7154 3171.1281 3177.8424 3186.5515 3501.9474 3540.3084 3545.9226 3571.7074
redmass: 4.2779 4.6894 5.5425 4.8273 4.1844 4.8319 4.0980 2.1173 3.0717 1.7509 3.9258 6.3495 6.3607 4.5952 4.7489 3.3667 1.5051 1.2365 2.8356 1.3459 1.2505 3.2608 4.7399 4.4858 4.0023 3.8326 3.3501 1.2635 5.3251 5.7040 3.4395 4.6480 3.5124 4.3648 4.3469 1.1588 3.5999 6.1420 5.9961 6.3530 5.6565 4.7736 4.3080 5.7474 3.9842 3.7337 3.4615 5.3497 1.6814 2.3037 1.5027 1.1150 1.3043 3.4797 2.1854 1.5372 1.8438 1.3729 2.8914 1.5001 2.9629 2.9719 9.4777 6.5922 2.6077 2.7479 2.2835 2.2836 2.1447 2.1060 1.6566 1.4434 1.4538 1.6517 1.1948 1.2816 1.3360 1.7365 1.5999 1.6264 1.4530 1.7584 1.1640 1.3322 2.2413 1.3169 1.1583 1.6399 1.3174 1.3068 1.6698 1.5055 1.3063 1.7971 5.0273 3.4904 4.5627 2.4904 1.0401 1.0401 1.0705 1.0679 1.0922 1.1597 2.9529 3.0333 6.6316 6.6167 6.8372 6.9232 1.0820 1.0852 1.0556 1.0560 1.0361 1.0361 1.1076 1.1081 1.0988 1.0989 1.1017 1.1013 1.0877 1.0896 1.0959 1.0945 1.0919 1.0906 1.0644 1.0657 1.0657 1.0659
irintensity: 0.6293 1.1192 0.4069 0.2124 3.3303 1.8804 1.0112 2.0012 1.6480 3.3420 2.2540 2.2009 0.2296 3.3774 0.2958 11.5185 0.4076 0.1385 5.4998 187.2719 165.7852 43.6694 5.1015 22.1187 4.7486 6.8067 14.7424 118.9575 10.1850 0.1487 10.3349 3.0083 6.9174 25.1925 10.1052 124.2965 15.2212 1.3429 3.8923 21.4788 11.6472 1.5387 19.2771 7.3437 1.5436 0.3452 9.5220 24.1533 50.2622 34.5803 2.5614 2.1275 16.6035 3.5321 15.6463 3.8334 35.0377 2.1846 15.3631 5.6671 52.4410 34.9423 56.9693 38.7991 44.3153 47.2526 175.0522 72.7567 5.8765 46.7750 66.0835 3.8118 11.6502 49.1783 55.8739 60.6622 182.3861 42.3887 63.2777 40.9805 27.0477 9.9216 0.1400 6.0394 147.6081 20.7428 23.1335 76.2886 13.2489 18.0379 27.9531 21.0659 48.1937 22.0668 31.4797 39.5363 37.5162 21.7076 9.9233 11.7486 9.6300 7.6296 11.1354 29.0872 94.5776 65.6387 38.8126 20.3504 8.4736 16.1660 43.8165 128.0381 25.9651 22.3353 20.7002 23.9600 31.3328 20.3644 6.7954 39.8377 39.6272 29.7554 19.2592 16.5147 19.7016 10.0840 1.4395 2.2764 69.9992 4.4714 3.1299 34.2991
temp: 298.150 k
press: 1.00000 atm
elementType: 8 8 8 8 8 8 6 6 6 6 6 6 6 6 6 6 6 6 6 6 6 6 6 6 1 1 1 1 1 1 1 1 1 1 1 1 1 1 1 1 1 1 1 1 1 1
symmnumber: 1
zpe: 962031.0 jmol-1
zpe.correction: 0.366418 hartree
zpe.thermalcorrener: 0.391503 hartree
zpe.thermalcorrenthalpy: 0.392447 hartree
zpe.thermalcorrgfe: 0.309338 hartree
zpe.sumelectzpe: -1148.610158 hartree
zpe.sumelectthermal: -1148.585073 hartree
zpe.sumelectthermalent: -1148.584129 hartree
zpe.sumelectthermalfe: -1148.667238 hartree
dipole: -1.6512 2.0604 -2.1750
dipole: 3.4209
quadrupole: -148.8131 -123.1646 -132.7299
quadrupole: 2.6485 15.0026 2.5120
quadrupole: -13.9105 11.7379 2.1727 2.6485 15.0026 2.5120
hfenergy: -1148.976576 hartree
pointgroup: C01 [X(C18H22O6)]
dipole: 0.5054461 -0.8212072 -0.9389012 debye
polarizability: 199.2482544|13.150321|250.6093026|-46.6620671|10.4860978|198.0229282 unknown
InChI: InChI=1S/C18H22O6/c1-3-23-15-9-11(5-7-13(15)19)17(21)18(22)12-6-8-14(20)16(10-12)24-4-2/h5-10,17-22H,3-4H2,1-2H3
charge 0 multiplicity 1
46 atoms
O  0.055195 -3.129695 1.79304
O  -1.175335 -2.819442 -1.760257
O  2.446948 1.359863 1.15688
O  -1.513197 2.277931 -0.926156
O  3.990155 1.043421 -1.015106
O  -3.161648 2.492019 1.16507
C  0.168944 -3.041002 0.330928
C  -1.249052 -2.722443 -0.294103
C  1.238661 -2.020574 0.004716
C  -1.802254 -1.357868 0.054676
C  1.367241 -0.85421 0.798647
C  -1.391933 -0.219364 -0.68668
C  2.065635 -2.184417 -1.125463
C  -2.68356 -1.198154 1.14751
C  2.281159 0.163109 0.452956
C  -1.845685 1.053802 -0.308673
C  2.991929 -1.175066 -1.478399
C  -3.144609 0.084803 1.527576
C  3.10065 -0.000202 -0.705806
C  -2.723681 1.213071 0.803593
C  1.607987 1.559587 2.359768
C  -0.501986 2.250656 -2.005717
C  1.973488 2.92988 2.922035
C  -0.270951 3.693495 -2.443212
H  0.47224 -4.033806 -0.081142
H  -1.940904 -3.506755 0.09769
H  0.734656 -0.763536 1.683761
H  -0.726467 -0.361602 -1.541054
H  1.998935 -3.091752 -1.736074
H  -3.026095 -2.075108 1.709417
H  -0.761129 -3.64116 2.027782
H  -0.69192 -3.649474 -2.007573
H  3.63476 -1.30348 -2.359444
H  -3.826456 0.223359 2.371541
H  0.536721 1.509936 2.076036
H  1.817658 0.752002 3.09052
H  0.426494 1.790168 -1.613576
H  -0.886821 1.630025 -2.839542
H  4.530049 0.802571 -1.809213
H  -2.762364 3.143118 0.527363
H  1.376343 3.138065 3.82848
H  3.043598 2.969176 3.187566
H  1.771707 3.721139 2.1800
H  0.473743 3.721985 -3.25903
H  -1.207181 4.148645 -2.810013
H  0.112732 4.299983 -1.60512
