program: Gaussian 09
title: 000241955
version: EM64L-G09RevD.01
frameworkgroup: C1[X(C10H19NO)]
method: RPBEPBE
basis: SDD
operation: Freq
keyword: #p
keyword: freq=noraman
keyword: PBEPBE/SDD
title: #p freq=noraman PBEPBE/SDD
converged: NO YES NO NO
title: Mulliken charges:
elementType: O N C C C C C C C C C C H H H H H H H H H H H H H H H H H H H
charge: -0.195350 -0.169349 0.331391 0.330483 -0.522401 -0.522455 0.148201 -0.728742 -0.773797 -0.728418 -0.773466 -0.692800 0.228907 0.230067 0.230103 0.228914 0.231812 0.217370 0.220716 0.219659 0.234763 0.222673 0.231714 0.220559 0.217891 0.219064 0.222988 0.234998 0.190732 0.247044 0.246729
chargesum: 0.00000
title: Mulliken charges with hydrogens summed into heavy atoms:
elementType: O N C C C C C C C C C C
charge: -0.195350 -0.169349 0.331391 0.330483 -0.063428 -0.063438 0.148201 -0.058844 -0.096701 -0.058255 -0.096416 -0.008294
polarizability: 1.22745788e+02 -1.09131785e-02 1.21467256e+02 1.67951754e-02 3.02016965e+00 9.96681450e+01
1716.lowfreq: -12.8368 -0.0006 -0.0001 0.0004 13.6983 17.5402 77.3564 87.4935 116.0444
frequency: 77.3560 87.3608 116.0077 156.1058 181.9385 229.8303 249.0759 258.3111 276.3267 280.8685 305.5950 327.9448 338.7964 356.4209 361.2888 406.6556 425.6899 439.4349 483.5233 491.4859 522.2586 537.9695 581.2220 693.4788 751.0436 837.7372 853.4030 872.5858 907.4714 918.4250 920.9996 929.7315 947.6749 977.0706 1000.5676 1013.6040 1066.2084 1100.9779 1108.8845 1127.8890 1143.3380 1175.5166 1189.6708 1203.5926 1227.4968 1242.6087 1253.2248 1277.3127 1293.2813 1299.0905 1374.9565 1378.5680 1390.4304 1395.4356 1428.4471 1437.5574 1443.0809 1456.7120 1463.6716 1465.5644 1469.6503 1471.9627 1486.2494 1490.7174 1493.9773 1499.4618 1502.2263 1632.0752 2884.0452 2980.1939 2980.8809 2983.6804 2986.2108 2990.9464 2997.3890 3059.6991 3067.8681 3070.7984 3075.6356 3078.4669 3079.6084 3082.2832 3087.6709 3089.4746 3091.7346 3100.9552 3110.4470
redmass: 5.0854 2.6645 2.9251 1.0817 1.0502 1.9790 1.2666 1.4978 1.7089 1.2699 2.2554 2.2473 2.5336 3.3440 2.9253 2.2805 2.0553 2.2622 3.1305 2.5122 3.1353 2.7147 4.4565 3.1053 3.0389 2.7878 1.8851 3.4568 1.7774 1.6907 1.8224 1.5049 1.8774 1.6085 1.2748 1.4306 1.3865 3.4172 1.3464 1.9894 2.0233 2.5160 2.7516 2.1181 1.9490 1.8322 2.4846 1.9092 2.6623 1.6139 1.1948 1.1963 1.1988 1.1960 1.1085 1.1280 1.0987 1.0492 1.0556 1.0526 1.0522 1.0557 1.0493 1.0580 1.0542 1.0478 1.0534 8.8887 1.0588 1.0352 1.0353 1.0371 1.0370 1.0601 1.0609 1.0717 1.0995 1.0981 1.0997 1.0982 1.0995 1.1002 1.1005 1.1003 1.1000 1.0976 1.0981
irintensity: 3.6227 1.0035 0.3465 0.1064 0.0607 3.0539 1.0423 0.5046 0.1215 0.7193 1.3980 0.1588 0.9278 2.6245 0.2811 3.3023 0.1665 0.3128 3.1262 4.2400 8.9833 8.6575 4.0660 2.0624 1.4633 3.2746 7.8145 3.6956 0.0045 3.1003 0.2296 0.2133 11.0560 1.4058 3.5610 5.4436 1.1270 11.9810 13.6121 34.5251 5.5505 2.4687 14.4729 8.4339 31.2127 20.4177 85.0064 4.1222 116.6956 24.1185 2.0975 39.9093 31.7371 18.5375 17.9124 7.3766 5.5276 4.3152 21.3091 0.4799 6.8309 1.1188 13.1758 2.9584 6.7348 7.9652 13.0924 171.7306 94.0451 6.2627 31.6617 28.5430 26.4532 11.4885 13.8150 36.5503 15.8253 9.7042 4.6840 55.8573 43.3423 26.6919 15.9733 38.5594 25.2407 33.3899 24.0995
temp: 298.150 k
press: 1.00000 atm
elementType: 8 7 6 6 6 6 6 6 6 6 6 6 1 1 1 1 1 1 1 1 1 1 1 1 1 1 1 1 1 1 1
symmnumber: 1
zpe: 717179.7 jmol-1
zpe.correction: 0.273159 hartree
zpe.thermalcorrener: 0.286729 hartree
zpe.thermalcorrenthalpy: 0.287673 hartree
zpe.thermalcorrgfe: 0.235133 hartree
zpe.sumelectzpe: -521.439721 hartree
zpe.sumelectthermal: -521.426151 hartree
zpe.sumelectthermalent: -521.425207 hartree
zpe.sumelectthermalfe: -521.477747 hartree
dipole: -0.0104 -3.4994 -0.6981
dipole: 3.5683
quadrupole: -70.7667 -87.1579 -75.2345
quadrupole: -0.0326 -0.0107 -3.9149
quadrupole: 6.9530 -9.4382 2.4852 -0.0326 -0.0107 -3.9149
hfenergy: -521.7128799 hartree
pointgroup: C01 [X(C10H19N1O1)]
dipole: -0.022836 1.3643398 0.3300958 debye
polarizability: 122.7451503|0.0336702|121.1881708|-0.0735902|3.8904674|99.9478679 unknown
InChI: InChI=1S/C10H19NO/c1-9(2)6-8(12)7-10(3,4)11(9)5/h6-7H2,1-5H3
charge 0 multiplicity 1
31 atoms
O  0.046582 -2.931031 -0.409511
N  -0.016039 1.03497 0.331992
C  1.299353 0.35983 0.02411
C  -1.310168 0.319634 0.024115
C  1.281623 -1.087584 0.626779
C  -1.247199 -1.127233 0.624756
C  0.029045 -1.841778 0.228421
C  1.659061 0.269741 -1.495354
C  2.443955 1.123962 0.747705
C  -1.668722 0.22225 -1.49502
C  -2.478077 1.045988 0.750085
C  -0.036758 2.474668 -0.006855
H  1.30503 -0.994709 1.730185
H  2.175768 -1.640722 0.292072
H  -2.123151 -1.707741 0.288383
H  -1.275066 -1.036329 1.728263
H  1.062886 -0.491346 -2.025353
H  1.507604 1.243389 -1.996303
H  2.723917 -0.004051 -1.613749
H  2.727997 2.05411 0.224575
H  2.146255 1.370443 1.782618
H  3.344235 0.484117 0.785022
H  -1.04489 -0.512829 -2.029768
H  -2.722701 -0.091068 -1.613058
H  -1.555763 1.203474 -1.991569
H  -2.793995 1.965689 0.226852
H  -3.356635 0.376743 0.789836
H  -2.186405 1.302891 1.784171
H  -0.028962 2.695268 -1.10161
H  0.833518 2.979424 0.440717
H  -0.9330 2.949129 0.421691
