program: Gaussian 09
title: 000241949
version: EM64L-G09RevD.01
frameworkgroup: C1[X(C8H14O3)]
method: RPBEPBE
basis: SDD
operation: Freq
keyword: #pfreq=noraman
keyword: PBEPBE/SDD
title: #p freq=noraman PBEPBE/SDD
converged: YES YES NO NO
title: Mulliken charges:
elementType: O O O C C C C C C C C H H H H H H H H H H H H H H
charge: -0.453321 -0.300421 -0.219285 0.190852 -0.463651 -0.461228 -0.415249 -0.394067 -0.385143 0.200388 -0.499997 0.222067 0.224160 0.213696 0.223258 0.196892 0.246842 0.209410 0.200085 0.205347 0.186539 0.349457 0.234030 0.244346 0.244994
chargesum: 0.00000
title: Mulliken charges with hydrogens summed into heavy atoms:
elementType: O O O C C C C C C C C
charge: -0.103864 -0.300421 -0.219285 0.190852 -0.017424 -0.024273 0.028484 0.015428 0.006743 0.200388 0.223372
polarizability: 1.06200502e+02 -1.66055570e+00 8.54669783e+01 -4.52708251e+00 2.29394873e+00 8.45128175e+01
1716.lowfreq: -19.8958 -9.9035 -0.0010 -0.0007 0.0004 18.4875 33.3250 82.6185 95.0712
frequency: 25.5009 82.5779 94.9593 127.4075 162.1068 210.0660 256.1017 280.6752 312.1313 329.0567 356.4070 387.0847 405.2233 441.5217 480.1662 541.6918 564.9542 717.8264 741.5206 783.0482 802.3754 847.5088 875.0751 908.5795 935.8827 944.9382 960.6303 1033.9383 1050.2158 1069.2663 1092.3211 1104.3868 1114.8161 1139.6013 1145.6831 1161.5202 1173.7727 1252.6936 1255.9416 1274.5818 1311.6692 1326.5355 1335.9130 1338.3983 1344.6454 1373.2811 1423.0381 1452.3753 1458.6383 1460.5976 1466.0486 1467.5702 1473.6761 1478.0631 1646.4838 2965.0734 2974.3571 2985.7077 2994.0526 3000.8184 3006.2001 3031.9235 3036.0951 3050.6270 3055.9854 3070.8813 3108.8215 3150.2947 3534.4109
redmass: 5.6384 1.2543 2.3527 2.9708 3.3732 2.7028 2.8222 2.6964 3.1514 4.5108 1.9884 2.3886 1.5488 3.2016 2.5733 2.3869 3.3502 6.3389 5.4476 1.4789 2.4949 2.0725 2.2484 2.3124 1.3748 2.8712 4.0294 3.9335 1.8451 1.4447 1.6915 2.7178 1.2771 1.7545 1.5605 1.6251 1.7248 1.3046 1.3085 1.5012 1.3892 1.4007 1.5810 1.3824 1.4886 1.7057 1.1667 1.0501 1.0837 1.0893 1.0505 1.0852 1.0828 1.0946 10.1022 1.0635 1.0620 1.0609 1.0616 1.0636 1.0294 1.0955 1.1006 1.1035 1.1000 1.1020 1.1047 1.1049 1.0650
irintensity: 3.0466 0.5845 0.4877 0.7648 2.4623 1.8264 4.6144 3.8908 10.8342 10.6780 0.8699 71.3273 94.3851 4.8643 3.0813 3.7700 12.2913 6.4325 9.8368 0.4491 5.8540 12.1967 23.4299 8.6145 4.0164 38.6605 13.7935 64.6334 8.5175 12.2395 98.3525 129.8510 2.3711 1.0666 35.4309 33.8791 20.1543 8.2648 5.4985 4.4782 1.4817 34.4455 1.0551 4.2982 5.4063 14.0449 11.3265 14.2413 7.8506 3.8618 15.8850 11.5203 25.8668 5.3090 133.5253 35.8959 27.7532 18.9244 31.6972 32.5065 31.7793 56.9885 52.7212 24.1510 30.2133 43.7731 23.9439 14.6007 9.1017
temp: 298.150 k
press: 1.00000 atm
elementType: 8 8 8 6 6 6 6 6 6 6 6 1 1 1 1 1 1 1 1 1 1 1 1 1 1
symmnumber: 1
zpe: 554863.5 jmol-1
zpe.correction: 0.211336 hartree
zpe.thermalcorrener: 0.223067 hartree
zpe.thermalcorrenthalpy: 0.224012 hartree
zpe.thermalcorrgfe: 0.173364 hartree
zpe.sumelectzpe: -538.035394 hartree
zpe.sumelectthermal: -538.023663 hartree
zpe.sumelectthermalent: -538.022719 hartree
zpe.sumelectthermalfe: -538.073367 hartree
dipole: -1.2846 -0.6861 2.1133
dipole: 2.5665
quadrupole: -54.3966 -72.6424 -67.6035
quadrupole: 0.8200 -2.2385 -0.5534
quadrupole: 10.4842 -7.7616 -2.7226 0.8200 -2.2385 -0.5534
hfenergy: -538.2467308 hartree
pointgroup: C01 [X(C8H14O3)]
dipole: 0.486456 0.8486488 0.2504834 debye
dipolederiv: -0.5857663 0.2601988 -0.0226787 0.2690724 -0.4589006 0.1277684 -0.0410832 0.1659308 -0.6691896 -1.3621634 -0.3346912 -0.084499 -0.3968993 -0.4028969 -0.0408062 -0.182688 -0.0627475 -0.5542802 -0.6047196 -0.0859771 0.1262913 -0.1251759 -0.281168 0.0061488 -0.2529115 -0.1298137 -0.8699339 0.3856517 -0.1572869 0.120795 -0.1222014 0.3593301 -0.0742532 0.1303457 -0.0931322 0.3179795 0.027137 0.0405001 -0.0582661 -0.0044239 0.0350796 -0.013704 -0.0129542 0.0122641 0.0251228 0.0037077 0.0491718 -0.0346159 -0.0018295 -0.0355397 0.0651384 0.0214845 -0.0129929 0.0047401 0.0952048 0.0250211 -0.0163928 -0.0084919 0.060728 -0.0257449 0.011519 -0.0059321 0.0700927 0.0900068 0.0039826 -0.0486888 -0.0026432 0.0668953 0.0084325 -0.0276921 -0.0443841 0.0919425 0.098738 0.0107729 -0.0343864 0.0325387 0.0458142 -0.0404657 -0.0580208 -0.0294467 0.1174407 1.3229219 0.3306679 0.0678239 0.4745991 0.2162907 0.0715352 0.4341778 0.2433783 1.0336045 0.6059258 0.0911174 -0.0599685 0.1163343 0.2992828 -0.0095069 -0.1575602 -0.043145 0.238708 -0.0280746 -0.0687522 0.0795848 -0.043935 0.0621199 0.0390579 0.0644073 0.080605 -0.0514134 0.0218675 0.1051171 0.0241992 0.0787373 -0.0767536 -0.0679429 0.011097 -0.0941454 0.032384 -0.0626717 -0.083812 -0.1206245 -0.0683354 -0.0144073 -0.0536301 -0.0871375 -0.053977 0.0217188 -0.0235597 -0.0174422 0.1220223 0.003853 0.0290432 0.0585158 0.0946983 0.0418743 -0.0391004 -0.1005035 -0.1093863 -0.1094756 -0.1029623 -0.0529855 -0.0816423 -0.0808736 -0.062402 0.03145 0.0632749 0.0051021 0.1120044 -0.0028938 0.0266838 0.0661296 0.0762188 0.0436165 -0.0408748 -0.0428033 -0.0825649 0.0733058 -0.0611013 0.0482102 0.0480485 0.0760252 0.090922 -0.0685591 0.001721 0.100499 0.0226617 0.0937696 -0.1369907 -0.0939448 0.0243216 -0.117641 0.0100541 -0.0496921 0.0804406 -0.100866 0.1045156 -0.0280397 0.0771916 -0.1387326 0.0838076 -0.0430467 -0.0406116 -0.0407351 0.0914858 -0.0808724 0.0174019 0.0368811 0.1604814 0.0190042 -0.0788347 0.2157563 -0.1168467 -0.085059 -0.1374369 0.2067444 -0.0779878 -0.1325758 -0.0469347 0.3545673 -0.031059 -0.0583669 -0.058783 -0.0680686 0.0925091 -0.0342939 -0.1085973 -0.0525228 0.0024548 0.0057621 0.05216 -0.0371235 -0.0073564 -0.0272446 0.0863308 0.0557709 0.120061 0.0173303 -0.0060507 0.0011101 0.0312533 0.0612069 -0.0512065 -0.077256 0.1202796 -0.0522466 0.0456425 unknown
polarizability: 106.0078615|3.259679|82.7994067|4.0862764|0.4972451|87.37303 unknown
InChI: InChI=1S/C8H14O3/c1-11-7(9)8(10)5-3-2-4-6-8/h10H,2-6H2,1H3
charge 0 multiplicity 1
25 atoms
O  0.502948 -1.331102 1.644915
O  2.16559 0.371414 0.352362
O  1.041118 -0.094202 -1.630534
C  -0.079878 -0.471277 0.591356
C  -1.155775 -1.329671 -0.104339
C  -0.706647 0.802022 1.227934
C  -2.049328 -0.523059 -1.077593
C  -1.558411 1.615532 0.224623
C  -2.659894 0.727157 -0.401501
C  1.049279 -0.065725 -0.382213
C  3.351189 0.771051 -0.442511
H  -1.77202 -1.762134 0.707402
H  -0.668801 -2.17071 -0.629615
H  0.090077 1.428557 1.67271
H  -1.351459 0.444384 2.054875
H  -2.855022 -1.182861 -1.452676
H  -1.447963 -0.214734 -1.952169
H  -0.915602 2.027915 -0.579527
H  -2.009179 2.481399 0.746131
H  -3.244505 1.308406 -1.140215
H  -3.367068 0.412751 0.394381
H  1.293299 -0.857891 2.017005
H  4.084928 1.11986 0.297402
H  3.082636 1.574768 -1.148236
H  3.73609 -0.094253 -1.007667
