program: Gaussian 09
title: 000226345
version: EM64L-G09RevD.01
frameworkgroup: C1[X(C16H16O6)]
method: RPBEPBE
basis: SDD
operation: Freq
keyword: #pfreq=noraman
keyword: PBEPBE/SDD
title: #p freq=noraman PBEPBE/SDD
converged: YES YES NO NO
title: Mulliken charges:
elementType: O O O O O O C C C C C C C C C C C C C C C C H H H H H H H H H H H H H H H H
charge: -0.447545 -0.330145 -0.259697 -0.287698 -0.427188 -0.433286 -0.392425 0.661104 0.049416 0.397198 -0.507016 -0.471966 0.232515 -0.475207 -0.378501 -0.334012 0.117655 0.217583 -0.361670 0.176448 -0.524452 -0.520331 0.244825 0.264558 0.234687 0.267537 0.279208 0.252986 0.223619 0.364459 0.379983 0.228930 0.233197 0.242431 0.368452 0.261154 0.217784 0.235408
chargesum: 0.00000
title: Mulliken charges with hydrogens summed into heavy atoms:
elementType: O O O O O O C C C C C C C C C C C C C C C C
charge: -0.083085 -0.330145 -0.259697 -0.287698 -0.047205 -0.064834 -0.147600 0.661104 0.049416 0.397198 -0.242458 -0.237279 0.232515 -0.207670 -0.099293 -0.081026 0.117655 0.217583 -0.138051 0.176448 0.180106 0.194016
polarizability: 2.34543653e+02 1.04364222e+01 2.15160247e+02 3.48422612e+00 -1.95917943e+01 1.62861553e+02
1716.lowfreq: -9.6596 -2.9073 -0.0010 -0.0009 -0.0008 2.2471 16.1274 22.9978 30.3219
frequency: 15.9352 22.8206 30.3036 47.0047 72.3478 89.6103 101.6682 107.8798 122.8617 128.5206 158.2422 180.3621 201.8008 219.3679 245.5293 257.1415 272.8486 296.8907 312.6061 320.6766 348.1333 364.2188 381.0479 385.3575 403.0706 445.0626 454.1090 468.0349 489.8609 500.9718 507.0400 522.1594 538.9081 567.0463 596.0951 630.4937 637.5947 669.5811 724.1366 726.9185 730.8181 747.4068 787.1904 802.8417 818.4352 825.3366 856.3893 871.2761 892.2175 920.0961 934.8112 952.2743 961.2904 990.2333 1008.0065 1027.4938 1077.0294 1113.1444 1114.8096 1116.9201 1135.2274 1153.7171 1156.0084 1158.8134 1184.1720 1187.5672 1209.0340 1211.6715 1250.1875 1261.7988 1273.0765 1287.0518 1296.7475 1321.9579 1376.3478 1396.8401 1406.4029 1420.2918 1426.3749 1438.9690 1448.3818 1457.9159 1464.4918 1473.3654 1478.5128 1499.2017 1504.5457 1546.6854 1590.4529 1607.6596 1609.0724 1620.2678 2968.7254 2981.9685 3005.9524 3059.6053 3091.4331 3112.9409 3126.3613 3129.0933 3134.0750 3148.5340 3169.9516 3171.0532 3183.4965 3380.0001 3509.0781 3572.6029
redmass: 4.9108 4.8496 4.4877 2.2115 9.2224 3.4039 4.3795 6.6369 3.8990 2.2701 3.8041 1.6863 2.4652 4.2358 2.6040 4.5324 5.2929 5.4886 5.9407 4.7800 3.9277 5.6198 1.1701 6.6286 5.7545 3.1508 3.5119 3.5481 1.3487 1.9459 1.7526 4.4175 5.2241 4.8396 5.2751 4.6330 6.6529 5.6729 4.0308 3.6130 4.8720 4.5065 4.7675 2.2267 1.5951 2.1166 2.2507 2.3657 1.9615 4.3889 1.3716 6.5182 1.3665 5.0126 4.4369 3.0868 2.1878 1.2445 1.9312 1.2564 2.1230 1.3312 1.4478 1.1635 1.7321 1.4040 1.5389 2.2563 2.0858 1.6050 2.3687 2.4176 2.0827 1.4510 1.4708 2.5994 6.3921 3.6487 2.0565 1.3155 1.5458 1.0615 1.0500 1.0977 1.0549 3.1498 3.0452 7.3538 6.8325 6.7798 6.7243 6.5835 1.0323 1.0340 1.0840 1.1045 1.0987 1.0901 1.0900 1.1003 1.1046 1.0911 1.0941 1.0949 1.0912 1.0638 1.0645 1.0661
irintensity: 0.4367 1.6464 1.5633 4.7550 0.1529 5.8410 0.2627 0.1683 1.0428 10.9035 2.0438 0.1880 5.2831 4.1919 3.4585 4.4034 1.1510 5.0704 1.5615 12.0848 11.8233 17.7476 141.4633 4.3491 6.1516 9.7748 5.6168 6.1419 102.6366 81.0938 61.7834 7.2860 42.9676 16.4290 2.3380 33.4768 11.7550 36.3407 5.4329 3.9027 26.9060 6.3817 2.7403 45.0895 30.5860 11.3558 18.4749 14.2259 29.4290 9.2691 0.7122 200.5014 3.2311 16.8250 48.0996 45.3780 172.3298 3.6090 38.8326 0.1648 55.2329 21.7003 39.1561 40.4226 119.1438 170.0228 30.1924 51.0798 35.5199 82.2078 484.6673 49.4053 205.8986 14.4294 71.9362 15.9461 1.6964 12.7406 44.6854 8.7980 13.8973 14.9439 15.1763 71.2175 27.3360 53.0054 126.4942 205.5172 4.2069 26.0169 70.3564 15.9061 46.8495 65.8178 28.7804 39.0972 34.0493 17.9692 14.8427 19.9786 13.5490 2.3560 3.5445 5.4579 1.5986 57.9281 88.3732 68.2781
temp: 298.150 k
press: 1.00000 atm
elementType: 8 8 8 8 8 8 6 6 6 6 6 6 6 6 6 6 6 6 6 6 6 6 1 1 1 1 1 1 1 1 1 1 1 1 1 1 1 1
symmnumber: 1
zpe: 757893.9 jmol-1
zpe.correction: 0.288667 hartree
zpe.thermalcorrener: 0.310214 hartree
zpe.thermalcorrenthalpy: 0.311158 hartree
zpe.thermalcorrgfe: 0.236238 hartree
zpe.sumelectzpe: -1068.991036 hartree
zpe.sumelectthermal: -1068.969489 hartree
zpe.sumelectthermalent: -1068.968545 hartree
zpe.sumelectthermalfe: -1069.043464 hartree
dipole: 3.5117 0.7478 5.6962
dipole: 6.7333
quadrupole: -108.3076 -135.0367 -121.5888
quadrupole: 4.5816 -0.0315 -8.5671
quadrupole: 13.3367 -13.3923 0.0556 4.5816 -0.0315 -8.5671
hfenergy: -1069.2797029 hartree
pointgroup: C01[X(C16H16O6)]
dipole: 1.3709024 -1.0611936 -2.003032 debye
polarizability: 233.09303|-12.344597|200.0464991|-0.6142669|-31.5291878|179.4259241 unknown
InChI: InChI=1S/C16H16O6/c1-21-13-7-9(3-5-11(13)17)15(19)16(20)10-4-6-12(18)14(8-10)22-2/h3-8,15,17-19H,1-2H3
charge 0 multiplicity 1
38 atoms
O  -1.389218 3.086132 1.074602
O  -3.996271 -0.924995 -1.517196
O  0.141426 2.866486 -1.046426
O  3.153546 -1.748729 1.52401
O  -4.077514 -2.709927 0.466144
O  4.907175 -1.493123 -0.739724
C  -0.607051 1.855505 1.013594
C  -1.508629 0.62656 0.867791
C  0.377359 1.956077 -0.18464
C  1.526252 1.030249 -0.324824
C  -2.299227 0.478127 -0.303642
C  -1.594501 -0.339041 1.894567
C  -3.148785 -0.632138 -0.426813
C  1.810338 0.016212 0.628425
C  2.381573 1.174357 -1.45203
C  -2.450406 -1.458177 1.769331
C  -3.225441 -1.611334 0.608225
C  2.919929 -0.83857 0.485458
C  3.492301 0.331605 -1.606728
C  3.780232 -0.666366 -0.642181
C  -4.039622 0.037239 -2.619909
C  3.429365 -3.159646 1.170354
H  -0.036367 1.778537 1.959143
H  -2.246798 1.23707 -1.09088
H  -1.00858 -0.21295 2.812972
H  1.173074 -0.147619 1.500623
H  2.156117 1.955833 -2.183393
H  -2.533566 -2.208388 2.560789
H  4.158044 0.452382 -2.471759
H  -1.232211 3.553715 0.201953
H  -4.547901 -2.627442 -0.406226
H  -3.046938 0.132949 -3.099687
H  -4.379663 1.02845 -2.264531
H  -4.764288 -0.371755 -3.338907
H  5.452112 -1.255041 -1.53113
H  4.369462 -3.250436 0.603579
H  2.58808 -3.578395 0.585861
H  3.506696 -3.677715 2.137705
