program: Gaussian 09
title: 000226343
version: EM64L-G09RevD.01
frameworkgroup: C1[X(C16H14O6)]
method: RPBEPBE
basis: SDD
operation: Freq
keyword: #pfreq=noraman
keyword: PBEPBE/SDD
title: #p freq=noraman PBEPBE/SDD
converged: YES YES NO NO
title: Mulliken charges:
elementType: O O O O O O C C C C C C C C C C C C C C C C H H H H H H H H H H H H H H
charge: -0.283559 -0.331964 -0.435752 -0.410112 -0.231662 -0.222597 0.364433 0.372181 0.000552 -0.020994 -0.495912 -0.435231 0.227551 0.221459 -0.320743 -0.379407 0.190133 0.132678 -0.373804 -0.321529 -0.520106 -0.524657 0.299095 0.288344 0.272066 0.278839 0.222150 0.258346 0.367658 0.387231 0.262109 0.212499 0.234984 0.243466 0.241344 0.230908
chargesum: 0.00000
title: Mulliken charges with hydrogens summed into heavy atoms:
elementType: O O O O O O C C C C C C C C C C C C C C C C
charge: -0.283559 -0.331964 -0.068094 -0.022881 -0.231662 -0.222597 0.364433 0.372181 0.000552 -0.020994 -0.196816 -0.146887 0.227551 0.221459 -0.048677 -0.100568 0.190133 0.132678 -0.151654 -0.063183 0.189487 0.191061
polarizability: 3.47083642e+02 4.70177357e+00 2.05195435e+02 2.83310304e+00 1.23616696e+01 1.14946993e+02
1716.lowfreq: -3.6028 -2.5140 -0.0006 -0.0005 0.0004 5.7091 16.5077 21.5005 29.6538
frequency: 16.4787 21.2452 29.6490 63.9751 87.7594 98.0746 102.2907 105.6288 133.4623 142.9755 177.5527 184.3637 193.5457 216.5951 241.7909 256.9306 269.3487 295.7086 322.1008 325.9859 342.5509 355.9531 384.4080 385.5739 411.1873 440.2605 459.2781 474.7851 500.3543 533.1304 551.1718 557.9825 573.5364 599.1713 617.8830 641.4055 690.7795 713.6226 720.8808 731.9269 763.7782 775.4979 791.8504 812.9471 840.6506 855.8607 871.7120 906.3380 933.4083 937.2614 974.8211 980.9593 1003.9358 1039.8141 1087.0753 1110.8657 1112.2721 1117.0343 1152.0230 1153.7371 1159.9074 1173.5470 1184.0809 1193.5339 1225.1340 1252.6523 1272.1733 1279.9012 1302.7634 1320.0756 1400.7282 1403.2371 1410.8947 1432.0087 1439.7435 1449.5988 1458.0509 1465.3982 1474.4055 1479.8803 1493.1723 1504.7246 1528.4843 1536.7298 1582.3303 1596.1851 1608.2450 1612.5515 2974.8014 2979.3716 3068.2755 3090.1869 3114.9611 3133.0995 3133.9791 3157.4906 3167.9152 3178.1151 3185.2038 3190.9742 3489.7263 3572.0235
redmass: 7.2146 4.5435 5.9686 2.4047 3.4758 6.3908 5.6308 7.0104 1.9158 3.5857 3.1350 2.5994 3.0588 4.6457 1.7677 7.4929 4.0497 6.1050 5.3876 5.1553 4.4808 7.3702 4.5382 1.2912 7.6201 3.1333 3.9312 4.9066 5.5915 5.3210 1.0887 5.3861 5.1862 5.4770 6.6445 6.8950 6.5717 6.2681 4.1257 4.0234 4.9306 4.6243 2.3793 2.2818 1.4931 6.9840 1.6841 5.6064 1.5141 1.3770 1.3608 5.9954 4.3508 2.4703 2.2559 1.8379 1.2451 1.2565 1.3888 1.3429 1.8868 1.2590 1.6772 2.1510 2.6603 2.0701 2.7826 1.6019 1.8160 3.7094 3.8004 3.6441 4.0205 2.1375 1.3823 1.8152 1.0658 1.0486 1.1105 1.0624 3.0128 3.2731 9.2833 9.0187 6.5566 6.4978 6.9237 7.1080 1.0321 1.0350 1.1048 1.0971 1.0905 1.1048 1.1011 1.0885 1.0914 1.0964 1.0919 1.0941 1.0643 1.0660
irintensity: 0.5792 2.4189 1.1970 8.2619 5.9677 1.4239 1.8903 0.4671 0.9602 4.1282 2.8676 0.7200 3.0411 2.1628 1.4184 4.5558 8.6665 4.0902 5.3964 8.0424 15.1785 6.6268 14.0094 118.9091 7.8227 2.7837 3.4088 24.3594 9.9256 36.2964 152.8767 28.5465 1.7276 16.2297 67.0326 4.0905 25.1563 50.3694 6.2359 6.6610 58.3511 23.8407 20.6042 37.2597 7.9358 38.3769 22.5014 59.8949 6.8916 10.6416 0.9689 49.6309 28.2127 2.7501 279.6961 58.4428 5.7091 0.0936 8.2656 3.9508 129.4499 34.3544 226.7949 372.9914 338.8641 6.4269 424.1542 46.6875 11.2025 101.7455 17.8774 4.1368 12.5732 6.1066 34.3994 23.3652 19.1584 16.3852 94.5420 41.7446 209.8939 214.2637 199.3144 238.2888 59.0488 31.5730 66.9708 83.5139 38.2877 85.0774 34.7049 37.2100 19.1557 14.5368 22.9359 0.0519 5.8669 5.8999 10.7120 2.4061 143.0826 75.7196
temp: 298.150 k
press: 1.00000 atm
elementType: 8 8 8 8 8 8 6 6 6 6 6 6 6 6 6 6 6 6 6 6 6 6 1 1 1 1 1 1 1 1 1 1 1 1 1 1
symmnumber: 1
zpe: 699034.3 jmol-1
zpe.correction: 0.266248 hartree
zpe.thermalcorrener: 0.287270 hartree
zpe.thermalcorrenthalpy: 0.288215 hartree
zpe.thermalcorrgfe: 0.214456 hartree
zpe.sumelectzpe: -1067.819076 hartree
zpe.sumelectthermal: -1067.798053 hartree
zpe.sumelectthermalent: -1067.797109 hartree
zpe.sumelectthermalfe: -1067.870868 hartree
dipole: -1.8934 2.2507 -4.9563
dipole: 5.7633
quadrupole: -109.6294 -112.1763 -131.7926
quadrupole: 16.0638 14.9342 3.0663
quadrupole: 8.2366 5.6898 -13.9265 16.0638 14.9342 3.0663
hfenergy: -1068.0853239 hartree
pointgroup: C01 [X(C16H14O6)]
dipole: -0.7449312 -1.6049404 1.4179521 debye
polarizability: 346.1099085|-7.0943755|179.716338|-11.2268501|43.0942835|141.399823 unknown
InChI: InChI=1S/C16H14O6/c1-21-13-7-9(3-5-11(13)17)15(19)16(20)10-4-6-12(18)14(8-10)22-2/h3-8,17-18H,1-2H3
charge 0 multiplicity 1
36 atoms
O  -4.985982 -1.105002 -0.93124
O  4.305597 -2.343085 -0.551399
O  -5.606063 0.252772 1.5340
O  6.082848 -0.71407 0.569746
O  -0.106796 -0.273983 -1.781606
O  0.49553 2.461772 0.209892
C  -1.693303 0.400671 -0.088967
C  2.148278 0.708632 0.019108
C  -0.34897 0.39355 -0.724938
C  0.77889 1.264372 -0.119692
C  -2.72796 -0.34372 -0.720714
C  2.490077 -0.618596 -0.384824
C  -4.02271 -0.419094 -0.180474
C  3.799245 -1.076293 -0.197278
C  -1.975815 1.076859 1.130919
C  3.144987 1.539983 0.606068
C  -4.297004 0.286806 1.033916
C  4.790991 -0.236274 0.395466
C  -3.266811 1.009948 1.681711
C  4.456747 1.073549 0.79651
C  -5.882282 -2.054239 -0.235539
C  3.390524 -3.276688 -1.216774
H  -2.516361 -0.868766 -1.657178
H  1.736383 -1.244641 -0.866081
H  -1.202358 1.665413 1.627959
H  2.860863 2.553657 0.904811
H  -3.490856 1.543855 2.614895
H  5.23223 1.699887 1.246057
H  -5.688132 0.821055 2.34042
H  6.124812 -1.645221 0.218716
H  -6.522955 -1.536291 0.495367
H  -5.290313 -2.842118 0.26887
H  -6.488919 -2.499904 -1.037961
H  3.990163 -4.173688 -1.428045
H  3.00792 -2.844792 -2.160217
H  2.544105 -3.536015 -0.553406
