program: Gaussian 09
title: 000226342
version: EM64L-G09RevD.01
frameworkgroup: C1[X(C16H14O4)]
method: RPBEPBE
basis: SDD
operation: Freq
keyword: #pfreq=noraman
keyword: PBEPBE/SDD
title: #p freq=noraman PBEPBE/SDD
converged: YES YES NO NO
title: Mulliken charges:
elementType: O O O O C C C C C C C C C C C C C C C C H H H H H H H H H H H H H H
charge: -0.280327 -0.211946 -0.326888 -0.424941 -0.235037 -0.540079 0.561837 0.086117 0.182791 0.230051 -0.484685 -0.471165 -0.360319 -0.375440 0.222011 -0.320659 0.121080 -0.249415 -0.199063 -0.523347 0.242247 0.264268 0.252029 0.262692 0.237017 0.276183 0.256985 0.253660 0.235584 0.233870 0.381199 0.231664 0.227432 0.244594
chargesum: 0.00000
title: Mulliken charges with hydrogens summed into heavy atoms:
elementType: O O O O C C C C C C C C C C C C C C C C
charge: -0.280327 -0.211946 -0.326888 -0.043742 0.007210 -0.023783 0.561837 0.086117 0.182791 0.230051 -0.221993 -0.234147 -0.084136 -0.118456 0.222011 -0.066999 0.121080 -0.013831 0.034807 0.180343
polarizability: 2.67113934e+02 8.20855250e+00 1.79062328e+02 2.02036589e+00 -4.40409252e+00 1.25128035e+02
1716.lowfreq: -7.3790 -3.7135 0.0008 0.0010 0.0011 1.4394 18.1390 41.9012 51.3608
frequency: 17.6884 41.8846 51.3582 89.3828 95.7856 133.9572 142.8310 162.7260 191.1940 210.8657 234.3588 259.6303 267.8600 285.5693 333.5862 368.3810 399.9807 437.7638 446.0513 454.5474 497.4222 500.8920 513.0766 523.6137 536.1844 552.3152 559.9581 607.0342 630.0788 644.5354 704.6180 724.7958 733.2230 754.2060 774.5483 795.7320 809.1913 823.5022 859.8507 865.6679 878.8765 931.6056 936.6148 963.5126 974.6706 996.1806 1009.3080 1021.4273 1038.3360 1058.0325 1107.8263 1114.1972 1117.4874 1142.5563 1155.9519 1162.6479 1175.3707 1186.7816 1204.7577 1219.5744 1229.3564 1252.4008 1270.6362 1296.9910 1311.6043 1315.5347 1348.3966 1392.0055 1421.1008 1424.1027 1426.8212 1447.4159 1450.9852 1458.5748 1464.8851 1473.8270 1509.4275 1571.1718 1592.8043 1611.2448 1621.1379 1622.9520 2969.3730 2976.2476 2992.5898 3060.2862 3082.7572 3130.2975 3133.8318 3135.9722 3147.5648 3161.0997 3163.4507 3174.2301 3174.4684 3512.2552
redmass: 5.0015 5.3857 6.4784 3.3265 4.6701 3.3305 5.6444 4.6324 1.5944 3.6570 5.9911 2.6710 5.1588 5.6027 4.0610 6.1291 3.2599 4.6366 3.2993 4.9496 3.3186 1.3345 4.0196 3.7304 5.6377 5.2592 3.0400 6.3802 4.3892 4.4925 5.2657 3.7360 4.6143 4.2003 1.3086 4.5556 3.0444 1.7695 3.0087 1.7063 1.4776 2.8314 1.7353 2.3973 1.5809 1.3558 3.9997 2.7120 3.6208 3.0288 1.7567 1.9034 1.2570 1.7105 1.3660 1.3502 1.3390 1.3843 2.4493 1.9128 1.7393 1.4312 1.8111 2.1757 1.9498 1.3293 1.8552 9.5256 1.5376 1.7013 2.1368 2.5513 1.7086 2.5170 1.0502 1.0882 3.3282 7.1824 9.1197 6.6074 7.6006 6.8107 1.0323 1.0814 1.0683 1.1045 1.0959 1.1004 1.0899 1.0860 1.0901 1.0909 1.0950 1.0997 1.0953 1.0645
irintensity: 1.0323 0.1489 0.1755 7.7850 7.2385 1.0840 1.3044 1.9603 0.7118 1.2868 0.1754 1.1275 5.2287 4.9982 4.0171 1.4990 1.8319 1.0291 9.9247 5.9286 29.5954 106.9735 8.5942 4.6375 5.5684 36.3101 3.1395 13.5259 8.5849 3.8799 0.3011 0.5449 19.8674 27.8470 86.9889 6.0781 27.4769 13.6998 46.9256 35.9115 6.6417 8.1480 1.1696 21.6822 5.1620 0.6493 43.4509 40.4441 29.7253 6.9485 52.1596 38.7989 0.2720 37.9505 54.1395 27.6278 11.6445 288.8999 109.5507 1.6791 26.0755 24.7412 38.6050 179.7858 71.6259 13.2242 135.2078 20.2278 9.9489 4.4832 17.9191 103.5328 30.1296 47.1774 15.1110 64.3996 126.3469 17.3483 254.8208 32.2489 91.4616 22.5538 46.6588 14.2273 14.1461 39.0735 6.2833 24.1832 8.3668 4.1611 3.2987 4.2523 15.3317 21.3246 3.8216 91.5632
temp: 298.150 k
press: 1.00000 atm
elementType: 8 8 8 8 6 6 6 6 6 6 6 6 6 6 6 6 6 6 6 6 1 1 1 1 1 1 1 1 1 1 1 1 1 1
symmnumber: 1
zpe: 686413.4 jmol-1
zpe.correction: 0.261441 hartree
zpe.thermalcorrener: 0.278630 hartree
zpe.thermalcorrenthalpy: 0.279574 hartree
zpe.thermalcorrgfe: 0.215335 hartree
zpe.sumelectzpe: -917.562084 hartree
zpe.sumelectthermal: -917.544895 hartree
zpe.sumelectthermalent: -917.543951 hartree
zpe.sumelectthermalfe: -917.608190 hartree
dipole: -0.2530 4.1007 0.1641
dipole: 4.1118
quadrupole: -118.4566 -110.6840 -117.1491
quadrupole: 2.1739 -13.4033 9.7013
quadrupole: -3.0267 4.7459 -1.7192 2.1739 -13.4033 9.7013
hfenergy: -917.8235247 hartree
pointgroup: C01 [X(C16H14O4)]
dipole: -0.1232784 1.5547784 0.4294248 debye
polarizability: 266.7038457|8.0595852|178.3277403|7.3146157|8.3207486|126.2727103 unknown
InChI: InChI=1S/C16H14O4/c1-19-16-8-10(6-7-12(16)17)15-9-13(18)11-4-2-3-5-14(11)20-15/h2-8,15,17H,9H2,1H3
charge 0 multiplicity 1
34 atoms
O  0.786488 0.735368 -0.509448
O  2.857558 -2.567668 1.072103
O  -4.187184 1.248345 1.000353
O  -5.515032 -0.279183 -0.742995
C  0.211182 -0.650934 -0.605293
C  0.710668 -1.495826 0.585846
C  -1.293472 -0.515072 -0.669926
C  2.240014 -1.551591 0.638137
C  2.925727 -0.307747 0.20169
C  2.169457 0.794811 -0.300264
C  -1.968981 0.352922 0.229121
C  -2.038627 -1.288927 -1.587541
C  4.331682 -0.162841 0.357036
C  2.804263 2.022149 -0.604741
C  -3.370467 0.428687 0.192997
C  -3.45122 -1.222651 -1.612465
C  -4.12142 -0.365515 -0.724178
C  4.969385 1.048176 0.043252
C  4.19611 2.14346 -0.4304
C  -3.524609 2.117747 1.97489
H  0.594062 -1.089469 -1.550353
H  0.306489 -2.520694 0.528706
H  0.34156 -1.047893 1.531032
H  -1.383753 0.976889 0.911085
H  -1.520177 -1.950464 -2.291063
H  4.888241 -1.023005 0.744859
H  2.199537 2.849579 -0.987616
H  -4.040545 -1.816866 -2.316343
H  6.05176 1.153404 0.167279
H  4.686469 3.092646 -0.673797
H  -5.79708 0.380795 -0.054605
H  -2.851323 2.835218 1.468781
H  -2.951913 1.520958 2.710112
H  -4.334748 2.659692 2.48395
