program: Gaussian 09
title: 000226341
version: EM64L-G09RevD.01
frameworkgroup: C1[X(C16H14O4)]
method: RPBEPBE
basis: SDD
operation: Freq
keyword: #pfreq=noraman
keyword: PBEPBE/SDD
title: #p freq=noraman PBEPBE/SDD
converged: YES YES NO NO
title: Mulliken charges:
elementType: O O O O C C C C C C C C C C C C C C C C H H H H H H H H H H H H H H
charge: -0.291028 -0.442644 -0.433699 -0.252144 0.352141 -0.463977 0.207295 0.327218 -0.374171 0.079169 0.181440 -0.367584 -0.242487 -0.297488 0.160211 -0.352984 -0.403733 -0.268931 -0.202679 -0.520397 0.245068 0.282297 0.218736 0.304902 0.205919 0.231664 0.220567 0.231442 0.231530 0.364827 0.212493 0.262779 0.230804 0.363442
chargesum: 0.00000
title: Mulliken charges with hydrogens summed into heavy atoms:
elementType: O O O O C C C C C C C C C C C C C C C C
charge: -0.291028 -0.077817 -0.070258 -0.252144 0.352141 -0.218909 0.207295 0.327218 -0.091875 0.079169 0.181440 -0.148847 0.062415 -0.091570 0.160211 -0.121320 -0.183166 -0.037488 0.028851 0.185679
polarizability: 3.89951651e+02 1.66370302e+01 2.15820847e+02 3.66730945e+00 -4.17171405e+00 8.00740229e+01
1716.lowfreq: -2.3978 -0.0008 -0.0008 -0.0007 5.9709 9.0175 15.2018 24.5519 45.7024
frequency: 15.1925 24.5380 45.6993 58.3497 81.7918 90.4972 124.2513 130.6820 138.1029 191.7027 196.8540 208.6674 249.5727 281.2574 297.2790 308.2429 342.4195 359.7885 361.3318 370.0086 397.0896 454.9702 455.0114 462.0104 503.7343 533.5227 536.6368 559.3374 584.2041 595.3887 633.0495 696.3409 722.6749 726.5148 747.4728 750.6317 756.2516 811.7939 816.0649 845.8757 851.4528 883.2211 890.0501 896.2375 936.1663 968.0111 974.8873 986.4655 1028.7405 1030.8647 1043.1830 1071.9687 1073.8880 1112.7906 1147.8759 1154.2058 1156.1634 1172.5564 1181.8974 1211.4078 1229.2934 1249.7461 1258.7706 1273.8443 1299.4608 1321.4657 1344.8573 1391.7424 1393.8471 1401.7388 1438.3173 1442.8279 1455.7395 1479.7866 1489.9279 1494.2697 1520.3543 1589.1096 1591.1797 1607.4056 1609.4012 1632.6530 2977.6408 3087.5107 3108.4814 3116.2436 3129.3675 3132.0972 3137.4587 3145.4039 3151.1854 3167.7034 3170.3392 3171.9929 3574.8578 3586.8612
redmass: 4.7873 5.7792 5.5617 2.2601 5.3009 3.6325 1.9714 5.9185 2.3341 4.5487 4.1775 3.5747 5.9617 5.7000 3.4444 4.4955 4.2226 3.8232 1.1281 1.3816 5.7146 3.6882 2.9115 4.0747 6.5970 3.6283 4.9096 4.8135 7.1305 4.9076 6.9233 3.5860 5.4663 3.6898 6.0575 2.1435 1.6730 6.0780 1.5079 1.4772 5.5690 1.9806 2.0728 3.1316 1.3850 1.3563 1.3354 5.7670 1.4658 1.8669 2.2286 2.2809 2.2327 1.2384 1.2784 1.3129 1.1923 1.0888 2.0407 1.5252 2.3511 2.2897 3.1552 1.4920 1.8889 1.3848 1.9344 3.4081 6.6482 6.7036 1.2753 2.5149 1.0615 1.0556 2.5965 3.4730 7.3344 6.3370 6.3961 6.6218 6.5746 5.6170 1.0347 1.0973 1.0900 1.0887 1.1048 1.0913 1.0867 1.0890 1.0928 1.0928 1.1001 1.0912 1.0660 1.0661
irintensity: 0.5079 4.7930 1.0764 5.4977 0.0164 1.0353 2.8890 2.0604 0.4833 0.8225 0.1757 2.6074 3.5741 13.2038 14.4276 2.0786 12.8022 30.4318 118.9608 125.6764 5.5785 6.9143 9.7879 9.6003 10.2786 3.9388 4.1488 3.8112 38.7160 5.5616 19.5030 3.2605 14.9568 8.0561 0.2659 12.4541 108.2173 15.3234 36.1392 0.2170 14.5645 18.2346 10.5637 25.4433 0.4189 1.9048 0.4743 77.5097 45.5237 40.5662 18.8669 125.8485 281.2123 5.1498 78.0989 11.8305 37.8740 15.3179 40.8914 43.5276 274.9567 25.0755 257.9733 137.0833 90.6663 157.0504 160.6562 4.0378 112.7768 0.7887 13.6357 40.8498 12.6445 28.1785 18.3666 16.6654 237.1979 28.0334 59.2167 180.4376 25.5572 241.5124 86.3800 38.1553 26.0440 18.2576 14.1176 3.5152 2.3031 7.3302 15.9462 8.5879 22.9578 8.4731 74.1148 46.5082
temp: 298.150 k
press: 1.00000 atm
elementType: 8 8 8 8 6 6 6 6 6 6 6 6 6 6 6 6 6 6 6 6 1 1 1 1 1 1 1 1 1 1 1 1 1 1
symmnumber: 1
zpe: 678340.8 jmol-1
zpe.correction: 0.258366 hartree
zpe.thermalcorrener: 0.277107 hartree
zpe.thermalcorrenthalpy: 0.278051 hartree
zpe.thermalcorrgfe: 0.209191 hartree
zpe.sumelectzpe: -917.538335 hartree
zpe.sumelectthermal: -917.519594 hartree
zpe.sumelectthermalent: -917.518650 hartree
zpe.sumelectthermalfe: -917.587510 hartree
dipole: 0.3687 1.9513 0.8216
dipole: 2.1491
quadrupole: -55.4842 -114.3890 -122.1079
quadrupole: 6.9102 -2.8106 3.3238
quadrupole: 41.8428 -17.0620 -24.7808 6.9102 -2.8106 3.3238
hfenergy: -917.7967011 hartree
pointgroup: C01 [X(C16H14O4)]
dipole: 0.1974502 0.7797878 0.2604824 debye
polarizability: 391.2884557|5.9022104|213.0219194|-4.4085676|-14.6010923|81.5361459 unknown
InChI: InChI=1S/C16H14O4/c1-20-16-10-12(7-9-15(16)19)14(18)8-6-11-4-2-3-5-13(11)17/h2-10,17,19H,1H3
charge 0 multiplicity 1
34 atoms
O  -3.598261 2.364993 -0.157997
O  -5.768851 0.457426 -0.081083
O  4.618424 -2.02586 0.429178
O  -0.107948 -2.59116 0.44485
C  -1.723292 -0.826733 0.176985
C  -2.058336 0.549507 0.077927
C  -3.398386 0.986127 0.016267
C  3.327581 -0.027957 0.009407
C  -2.778287 -1.777149 0.228209
C  -0.312691 -1.344698 0.2477
C  -4.440611 0.01339 0.039796
C  -4.11671 -1.360405 0.160889
C  2.115336 -0.834779 0.165547
C  0.818111 -0.397233 0.078663
C  4.608388 -0.652368 0.145682
C  3.314268 1.368157 -0.277911
C  5.807516 0.083815 0.000999
C  4.500732 2.109969 -0.423143
C  5.753959 1.463954 -0.282894
C  -4.621647 3.035647 0.672367
H  -1.297825 1.334483 0.051942
H  -2.512843 -2.83457 0.318772
H  -4.925903 -2.103035 0.186057
H  2.260264 -1.902821 0.372329
H  0.590859 0.653225 -0.128286
H  2.350442 1.875502 -0.391139
H  6.77728 -0.419128 0.109752
H  4.45643 3.18092 -0.644944
H  6.684121 2.031253 -0.394493
H  -6.390944 -0.312203 -0.092277
H  -4.402389 2.889112 1.747684
H  -5.630925 2.66107 0.43964
H  -4.533085 4.102069 0.415275
H  5.542924 -2.36912 0.503548
