program: Gaussian 09
title: 000242025
version: EM64L-G09RevD.01
frameworkgroup: C1[X(C23H26O9)]
method: RPBEPBE
basis: SDD
operation: Freq
keyword: #pfreq=noraman
keyword: PBEPBE/SDD
title: #p freq=noraman PBEPBE/SDD
converged: YES YES NO NO
title: Mulliken charges:
elementType: O O O O O O O O O C C C C C C C C C C C C C C C C C C C C C C C H H H H H H H H H H H H H H H H H H H H H H H H H H
charge: -0.183568 -0.440514 -0.452219 -0.208634 -0.297079 -0.296305 -0.233448 -0.278897 -0.259720 -0.055559 0.314204 -0.527017 -0.712970 -0.381578 0.321223 0.446492 0.201032 0.519430 -0.625394 -0.618628 -0.571448 -0.560255 0.195272 0.201311 0.190684 0.253680 0.028783 -0.530237 -0.530924 -0.537486 -0.539051 -0.520051 0.295279 0.270989 0.241630 0.264542 0.244380 0.371668 0.373731 0.278829 0.271679 0.279902 0.268559 0.224287 0.254352 0.235495 0.256994 0.235532 0.222309 0.249288 0.220265 0.214754 0.253037 0.222308 0.241825 0.230653 0.253998 0.212589
chargesum: 0.00000
title: Mulliken charges with hydrogens summed into heavy atoms:
elementType: O O O O O O O O O C C C C C C C C C C C C C C C C C C C C C C C
charge: -0.183568 -0.068846 -0.078488 -0.208634 -0.297079 -0.296305 -0.233448 -0.278897 -0.259720 -0.055559 0.314204 -0.231738 -0.200351 0.127345 0.321223 0.446492 0.201032 0.519430 -0.346565 -0.346950 -0.291547 -0.291696 0.195272 0.201311 0.190684 0.253680 0.028783 0.183896 0.183911 0.146820 0.178118 0.177189
polarizability: 3.57854100e+02 -2.08316929e+01 2.62568091e+02 -9.86082639e+00 1.75872529e+01 2.35745281e+02
1716.lowfreq: -3.5666 -0.0008 -0.0007 0.0001 1.8853 4.4208 16.2528 26.1519 41.1070
frequency: 16.1812 26.1318 41.0794 47.1319 56.0932 67.9805 74.9556 79.9761 89.1324 106.0182 109.7083 113.6827 125.4054 139.0501 151.8146 154.1850 162.5633 169.0975 178.3376 179.8588 191.5452 195.9692 204.5278 208.6657 230.3800 242.7479 253.1911 261.4589 273.0656 283.9434 288.8435 294.7333 298.9596 307.9453 338.3235 351.7039 353.3512 357.1342 374.5781 405.5345 410.0205 419.9169 446.4781 484.5438 490.3195 501.3242 521.2291 539.8281 557.7066 573.7593 583.4386 589.5738 601.0310 627.0946 639.9576 649.4116 665.5929 685.7598 700.7287 720.1247 728.2098 742.7745 754.4363 767.9364 772.1669 807.1367 851.4183 863.0188 865.7664 871.8951 892.8791 894.3542 911.9754 920.4462 934.9929 946.6719 952.8851 953.7554 958.5536 993.0615 1004.0169 1040.4128 1068.3318 1072.7144 1082.5725 1087.8760 1102.6465 1107.9249 1109.3418 1110.2729 1114.2983 1116.0467 1138.3778 1141.6298 1149.7785 1150.4169 1155.5246 1157.2636 1158.8230 1171.2529 1176.1287 1189.1694 1218.2406 1226.1087 1244.0585 1257.9777 1262.7649 1271.5132 1290.1447 1293.8418 1307.1099 1320.2418 1336.3949 1355.3506 1369.3826 1383.2242 1392.4536 1415.0475 1421.9239 1427.6295 1442.6441 1443.4340 1447.3903 1448.8108 1454.6034 1456.5037 1458.7982 1460.7829 1467.1433 1469.3505 1469.6328 1473.4386 1476.7701 1479.6548 1486.2745 1488.0579 1493.6595 1559.9466 1589.1430 1594.8597 1615.4114 1698.4677 2954.1645 2971.8233 2974.6063 2975.1414 2976.4952 2979.4060 2990.5604 3039.9611 3043.0947 3066.3237 3069.2879 3071.7553 3073.6944 3078.7215 3124.0640 3124.5407 3125.9588 3126.1957 3129.4252 3133.7107 3143.5264 3147.6456 3165.3965 3172.3188 3399.8152 3507.2537
redmass: 4.7096 5.1033 4.9727 4.6625 3.2295 3.7734 2.9301 3.9849 4.1912 3.7530 3.9299 2.9244 4.6350 5.3784 1.3838 1.2183 1.3210 1.8111 4.7985 4.3471 3.6752 3.1551 1.9587 2.9362 4.6703 4.2823 2.7785 1.7254 4.8996 2.8605 2.8750 3.5969 5.0210 1.5823 3.6973 4.1368 4.0405 3.1645 2.9495 6.0628 4.2231 4.7323 5.0686 5.9437 3.7839 6.6014 6.8296 4.6024 6.8470 3.8742 1.9390 4.4459 2.2517 5.4976 5.0321 5.9976 5.8359 6.5454 6.6053 6.2672 5.2978 4.0608 5.2639 3.6465 5.1084 3.9577 1.6209 1.9311 2.0053 3.8388 2.0588 1.7544 3.3916 2.1872 3.5909 7.1793 7.9554 7.5625 5.2699 5.1943 6.0452 4.3998 3.2437 3.1956 4.3111 6.1473 2.6964 1.2478 1.2675 1.2612 1.2400 1.2492 2.3336 2.2103 1.4085 1.5448 1.5301 1.4893 1.4802 1.6023 2.2127 1.5568 2.0015 1.4273 1.5946 1.4747 1.7228 1.4354 2.5698 1.9321 5.2875 1.7220 1.4175 2.0141 2.9682 4.2524 3.7956 1.8169 1.2330 1.1889 1.1894 1.1569 1.3175 1.4329 1.1000 1.0815 1.0574 1.0651 1.0513 1.0495 1.1795 1.0765 1.0574 1.0554 2.8309 1.0817 2.4912 8.0551 7.6805 5.5882 7.1470 12.5434 1.0333 1.0324 1.0309 1.0325 1.0314 1.0656 1.0832 1.1035 1.0600 1.1041 1.0944 1.1040 1.1039 1.1007 1.0990 1.1034 1.1028 1.1029 1.1011 1.1079 1.0917 1.0921 1.0895 1.0909 1.0643 1.0652
irintensity: 0.3677 0.0322 0.2980 0.2242 4.4920 3.4389 4.6694 5.7149 2.9895 8.7427 1.0643 7.4100 0.4614 4.6289 0.1990 1.7565 2.2623 6.3363 1.2449 1.4341 3.1475 5.1677 0.1678 0.9331 9.7165 3.3851 4.2178 1.2586 5.1220 5.5635 2.5587 11.3937 8.1949 35.3728 4.6730 1.8513 13.8524 3.1558 5.1598 6.5121 0.6486 16.6592 6.1545 1.1253 5.7297 6.2598 2.5844 9.0897 3.9787 4.7408 78.4153 8.0922 39.5090 9.2750 6.0122 5.4980 34.2436 4.6507 26.8501 5.4370 13.1909 6.0105 5.2809 2.6852 4.7625 5.0872 4.8638 3.7522 42.6865 11.2055 11.7717 1.0016 28.5466 48.0842 12.1174 14.3745 76.1534 40.2459 54.1422 85.6229 8.8309 47.2034 63.8800 55.2922 175.9707 171.9768 20.4443 15.3878 0.7592 0.1416 25.0381 2.3768 64.1873 37.9605 5.8068 22.6812 27.8194 18.7640 24.6937 64.9534 14.4272 15.3445 32.3037 35.4578 61.6672 54.6334 89.8048 15.0280 58.0218 24.8038 106.9755 97.1480 57.1145 41.3101 21.8982 12.0416 7.3425 75.4352 13.3034 0.8798 3.9101 4.6525 43.9002 12.2981 18.2101 6.6020 14.4974 9.4908 16.3135 18.8818 74.9576 72.6196 6.9471 19.1570 179.6513 5.6222 95.8851 7.5564 125.4642 24.9701 12.5071 216.5083 57.0899 47.3611 85.2077 87.6862 62.4511 14.6851 6.4376 43.4117 22.2747 29.8263 8.6053 29.9258 20.5468 33.1503 18.4482 28.6805 18.3591 26.0572 26.9098 8.9673 3.0058 1.3064 2.6067 0.7129 48.7267 42.4500
temp: 298.150 k
press: 1.00000 atm
elementType: 8 8 8 8 8 8 8 8 8 6 6 6 6 6 6 6 6 6 6 6 6 6 6 6 6 6 6 6 6 6 6 6 1 1 1 1 1 1 1 1 1 1 1 1 1 1 1 1 1 1 1 1 1 1 1 1 1 1
symmnumber: 1
zpe: 1187503.3 jmol-1
zpe.correction: 0.452296 hartree
zpe.thermalcorrener: 0.484399 hartree
zpe.thermalcorrenthalpy: 0.485343 hartree
zpe.thermalcorrgfe: 0.389290 hartree
zpe.sumelectzpe: -1566.580543 hartree
zpe.sumelectthermal: -1566.548440 hartree
zpe.sumelectthermalent: -1566.547496 hartree
zpe.sumelectthermalfe: -1566.643549 hartree
dipole: 5.1756 -4.6774 0.9933
dipole: 7.0463
quadrupole: -169.1559 -203.5145 -181.2820
quadrupole: -5.4425 -3.9278 2.0031
quadrupole: 15.4949 -18.8637 3.3688 -5.4425 -3.9278 2.0031
hfenergy: -1567.0328392 hartree
pointgroup: C01 [X(C23H26O9)]
dipole: -2.0373438 -1.8782908 0.081066 debye
polarizability: 358.2865806|17.8194757|251.6615009|-13.3103605|-21.7052803|246.219391 unknown
InChI: InChI=1S/C23H26O9/c1-27-15-8-13-10-22(25)11-32-21(24)23(22,26)19(14(13)9-16(15)28-2)12-6-17(29-3)20(31-5)18(7-12)30-4/h6-9,19,25-26H,10-11H2,1-5H3
charge 0 multiplicity 1
58 atoms
O  2.034905 3.150262 0.109399
O  -1.00631 2.865979 -1.548541
O  -0.86594 3.873379 0.859641
O  1.847076 2.982753 -2.193888
O  -4.369935 -1.806638 -1.768322
O  -5.349491 -0.885354 0.846795
O  1.795297 -2.886936 2.130968
O  4.761982 -0.681181 -0.900077
O  4.286749 -2.468158 1.209934
C  -0.009462 2.178016 -0.714237
C  -0.220583 2.557515 0.79703
C  -0.088747 0.634335 -0.991893
C  -1.05435 1.524755 1.600382
C  1.22808 2.737083 1.302366
C  -1.482137 0.205508 -0.532851
C  -1.964868 0.674032 0.724783
C  1.362016 2.804576 -1.066133
C  1.06573 -0.203925 -0.404442
C  -2.307951 -0.60531 -1.342704
C  -3.252824 0.285102 1.152581
C  2.360161 -0.064147 -0.95743
C  0.851767 -1.138315 0.633873
C  -3.600471 -0.981359 -0.918241
C  -4.066424 -0.554104 0.360044
C  1.927455 -1.919718 1.126116
C  3.443548 -0.811781 -0.441463
C  3.244243 -1.75662 0.607071
C  -5.630163 -1.194427 -2.256626
C  -5.597071 -2.336202 1.032027
C  0.46437 -3.076471 2.709642
C  5.040395 0.39396 -1.864215
C  5.076716 -3.362872 0.336943
H  -0.024266 0.546043 -2.095249
H  -1.640474 2.086364 2.346992
H  -0.369073 0.852645 2.153619
H  1.303179 3.551711 2.036643
H  1.66951 1.801673 1.683015
H  -1.765413 2.242699 -1.703497
H  -1.279584 4.030227 -0.038005
H  -1.963546 -0.958581 -2.320861
H  -3.649722 0.618368 2.117603
H  2.523003 0.624862 -1.789493
H  -0.158935 -1.290288 1.020109
H  -5.402116 -0.323411 -2.899383
H  -6.272772 -0.881068 -1.414361
H  -6.123478 -1.97848 -2.850301
H  -5.429761 -2.892065 0.092466
H  -6.64833 -2.413077 1.347401
H  -4.936278 -2.732204 1.826001
H  0.595496 -3.860027 3.470197
H  -0.266387 -3.413247 1.948053
H  0.095192 -2.149011 3.190778
H  4.719196 1.375902 -1.470372
H  4.544502 0.20266 -2.834901
H  6.132116 0.378914 -1.995934
H  5.816185 -3.82865 1.005714
H  5.581031 -2.789714 -0.459133
H  4.424959 -4.14198 -0.103033
