program: Gaussian 09
title: 000241961
version: EM64L-G09RevD.01
frameworkgroup: C1[X(C11H10BrNO6)]
method: RPBEPBE
basis: SDD
operation: Freq
keyword: #p
keyword: freq=noraman
keyword: PBEPBE/SDD
title: #p freq=noraman PBEPBE/SDD
converged: YES YES NO NO
title: Mulliken charges:
elementType: Br O O O O O O N C C C C C C C C C C C H H H H H H H H H H
charge: -0.037145 -0.266297 -0.217079 -0.424518 -0.233992 -0.193923 -0.189910 0.024593 0.243276 -0.335037 -0.298030 0.192872 -0.345505 -0.454798 0.154672 0.416936 -0.363003 -0.666899 0.116804 0.278619 0.235607 0.263178 0.222746 0.276671 0.327590 0.298043 0.275569 0.296145 0.402815
chargesum: 0.00000
title: Mulliken charges with hydrogens summed into heavy atoms:
elementType: Br O O O O O O N C C C C C C C C C C C
charge: -0.037145 -0.266297 -0.217079 -0.021703 -0.233992 -0.193923 -0.189910 0.024593 0.243276 0.179190 0.187895 0.192872 -0.068834 -0.127209 0.154672 0.416936 -0.064961 -0.095185 0.116804
polarizability: 2.34703036e+02 -4.37801594e-01 1.81658710e+02 2.38286592e+01 -6.71925679e+00 9.02320026e+01
1716.lowfreq: -6.7244 -0.0008 -0.0008 -0.0007 1.9985 3.3659 9.9634 14.6540 26.7777
frequency: 9.2432 14.6272 26.7506 48.5770 57.0410 82.3380 93.3137 106.9396 138.0164 148.9811 167.3699 182.5006 204.1095 218.9006 263.7248 286.6163 317.7985 340.3250 370.2285 408.7903 434.5467 462.2445 495.8567 528.7355 578.8239 603.2490 606.4270 631.5925 663.7805 666.4510 699.1631 729.0788 731.0394 738.7053 776.4138 785.5293 836.0822 872.9683 874.1660 904.3229 966.0776 971.6388 999.0997 1011.6728 1034.6921 1050.6980 1090.3331 1098.4446 1126.0982 1152.6827 1162.4626 1209.1508 1220.9453 1235.6462 1255.7240 1266.3787 1281.7436 1320.5071 1347.3088 1355.1133 1372.9238 1393.7183 1412.8824 1452.1821 1461.5422 1469.9639 1474.7001 1583.5858 1606.6346 1631.0866 1642.2150 3014.6925 3023.8228 3056.1148 3085.7088 3100.5078 3145.2921 3166.2569 3189.0587 3195.0958 3522.5782
redmass: 14.2342 9.2496 11.4967 9.1622 6.7145 6.2716 5.8329 3.5304 7.2395 5.9853 4.7556 5.1382 4.0046 8.0877 9.9398 7.5215 3.2553 9.9726 6.7945 3.8858 4.0745 4.6358 8.5596 4.4539 5.4857 2.9426 1.7984 3.6558 4.1825 6.6903 5.0883 2.2486 7.7410 5.9688 2.1552 4.4772 2.7811 5.4025 1.7046 2.1613 1.4810 1.9787 1.4051 4.3369 1.8183 4.9403 1.8307 2.6475 1.9353 1.3925 1.6941 6.4607 1.2165 3.8408 1.1749 1.4030 1.1827 2.6441 1.3259 1.3296 8.1068 8.4275 5.8410 1.1008 1.0892 1.2595 2.1547 8.4957 7.4127 10.9384 9.2654 1.0618 1.0589 1.0585 1.1004 1.1065 1.1098 1.0904 1.0961 1.0928 1.0644
irintensity: 0.4907 0.6112 0.2603 0.6777 0.4765 0.8385 5.7979 0.9297 4.6410 1.0980 3.6847 5.1975 1.5194 3.9979 2.0334 0.2550 8.3329 7.8207 12.2429 3.2335 4.5799 18.1249 8.1774 2.3699 30.8288 33.3292 88.3530 23.7640 40.5643 6.6711 55.3416 14.0722 16.3918 14.1899 22.0450 2.7836 9.2447 31.9354 22.2579 8.4467 26.9874 21.0735 5.9187 143.7374 34.1273 350.3362 17.1033 26.5092 8.9989 14.4997 62.4958 448.3710 5.6102 71.5026 28.9561 37.7843 7.0063 63.9529 8.5087 4.7039 123.9874 19.1566 30.4182 8.9929 31.5085 27.3542 4.9801 11.6267 12.4848 210.1243 224.6428 7.3310 43.9668 14.2079 3.9669 8.3817 12.4915 1.3459 2.5276 11.1450 54.8338
temp: 298.150 k
press: 1.00000 atm
elementType: 35 8 8 8 8 8 8 7 6 6 6 6 6 6 6 6 6 6 6 1 1 1 1 1 1 1 1 1 1
symmnumber: 1
zpe: 527926.1 jmol-1
zpe.correction: 0.201076 hartree
zpe.thermalcorrener: 0.219608 hartree
zpe.thermalcorrenthalpy: 0.220553 hartree
zpe.thermalcorrgfe: 0.148911 hartree
zpe.sumelectzpe: -943.259810 hartree
zpe.sumelectthermal: -943.241278 hartree
zpe.sumelectthermalent: -943.240334 hartree
zpe.sumelectthermalfe: -943.311976 hartree
dipole: 2.0175 2.1770 -1.4442
dipole: 3.3008
quadrupole: -144.9449 -119.5328 -120.0417
quadrupole: -6.3484 -4.6138 -11.4299
quadrupole: -16.7718 8.6403 8.1314 -6.3484 -4.6138 -11.4299
hfenergy: -943.4608862 hartree
pointgroup: C01 [X(C11H10Br1N1O6)]
dipole: -0.9367786 0.7636622 0.475112 debye
polarizability: 233.4119132|14.2592341|185.1377512|15.6035511|-5.0519404|88.0440832 unknown
InChI: InChI=1S/C11H10BrNO6/c12-4-1-5-19-11(16)8-3-2-7(13(17)18)6-9(8)10(14)15/h2-3,6,14H,1,4-5H2
charge 0 multiplicity 1
29 atoms
Br -5.053651 -2.441394 0.890673
O  -1.927682 1.161989 0.510939
O  -1.319551 2.573906 -1.257734
O  -0.282193 -2.590109 -0.187223
O  -1.546218 -1.010425 -1.32738
O  5.218621 0.408121 0.6325
O  4.439615 -1.72856 0.444544
N  4.276261 -0.450014 0.435018
C  0.320286 1.06034 -0.27006
C  -4.194013 0.277882 0.137825
C  -3.370892 1.550287 0.399069
C  0.557577 -0.345545 -0.275771
C  1.401947 1.953138 -0.080823
C  1.859105 -0.839655 -0.033534
C  -1.04839 1.667894 -0.440266
C  2.906266 0.074825 0.18056
C  2.704494 1.470313 0.147427
C  -4.092518 -0.700304 1.311687
C  -0.533196 -1.297872 -0.649743
H  -3.830897 -0.200151 -0.787391
H  -5.248525 0.572535 -0.021897
H  -3.478886 2.279664 -0.422136
H  -3.621263 2.027499 1.362546
H  1.210638 3.029764 -0.107154
H  2.055136 -1.914109 -0.024996
H  3.551634 2.143353 0.301589
H  -4.580445 -0.32812 2.226281
H  -3.053714 -0.991893 1.522428
H  -1.012945 -3.198557 -0.481977
