program: Gaussian 09
title: 000226335
version: EM64L-G09RevD.01
frameworkgroup: C1[X(C15H14O4)]
method: RPBEPBE
basis: SDD
operation: Freq
keyword: #pfreq=noraman
keyword: PBEPBE/SDD
title: #p freq=noraman PBEPBE/SDD
converged: YES YES NO NO
title: Mulliken charges:
elementType: O O O O C C C C C C C C C C C C C C C H H H H H H H H H H H H H H
charge: -0.282710 -0.287681 -0.446957 -0.254611 -0.426967 0.272528 0.442815 0.202931 -0.306286 0.283955 -0.481402 -0.357944 -0.439581 -0.370686 -0.220886 -0.220501 -0.236535 0.102984 -0.525314 0.224403 0.231400 0.253454 0.294615 0.273179 0.231787 0.258896 0.229846 0.230922 0.231970 0.214768 0.262672 0.232527 0.382410
chargesum: 0.00000
title: Mulliken charges with hydrogens summed into heavy atoms:
elementType: O O O O C C C C C C C C C C C C C C C
charge: -0.282710 -0.287681 -0.064547 -0.254611 0.028836 0.272528 0.442815 0.202931 -0.052832 0.283955 -0.186787 -0.084765 -0.207794 -0.111791 0.008959 0.010421 -0.004565 0.102984 0.184653
polarizability: 2.86463337e+02 -9.93245534e+00 1.68690587e+02 -1.01872765e+01 -1.71758640e+01 9.59069399e+01
1716.lowfreq: -2.8306 -0.0007 -0.0005 0.0004 4.9764 9.5931 23.0824 24.3679 49.2064
frequency: 23.0492 24.3259 49.1961 61.3725 76.4059 89.9217 125.5080 136.7684 142.6539 169.7683 200.4511 204.1139 263.0384 285.3263 330.2632 346.9604 391.6724 402.4494 415.3106 468.7524 485.8491 515.5791 542.6566 562.6000 579.3853 606.3893 616.2396 621.5575 687.0964 702.6941 720.2486 740.6288 750.4002 760.9950 821.2436 829.2488 855.3236 857.2183 917.2759 931.8336 953.3111 957.6251 971.0389 980.7373 990.1283 997.9027 1008.6518 1027.6550 1036.9344 1087.7302 1105.0672 1112.3621 1148.3646 1157.9290 1173.7678 1187.6036 1192.6468 1200.5950 1224.8773 1240.9538 1261.3805 1318.6230 1322.5425 1355.8998 1383.3306 1391.6441 1409.5936 1440.6330 1442.6862 1458.0780 1471.2301 1482.7559 1486.1419 1494.5416 1570.6048 1596.4843 1611.0516 1618.2907 1643.3288 2952.3240 2978.3767 3016.2144 3087.0560 3118.0977 3129.9149 3129.9788 3142.7684 3155.0552 3159.0019 3167.6441 3172.0816 3184.1841 3533.6202
redmass: 5.8148 3.9296 5.7110 8.1996 3.1602 2.8415 4.8436 5.8984 1.7121 3.2960 4.4647 3.7128 3.2910 4.0596 6.6707 4.6740 4.2634 2.8447 8.1956 3.3074 3.4501 5.6342 2.2450 5.2373 3.7209 3.7721 3.0758 3.3470 5.9893 2.1357 4.5094 1.9676 3.5046 3.4640 1.5533 3.7286 4.5863 1.3802 1.3680 1.4930 7.3164 1.3660 7.2719 1.3926 6.0498 1.3818 1.6549 2.1570 2.5856 1.5550 2.1261 1.2367 1.5877 1.4165 1.0551 1.1752 1.8751 1.1822 2.0412 2.3147 1.9455 1.3575 2.4142 1.6450 6.5545 3.6324 2.8541 1.8627 1.7024 1.0630 1.2265 1.0560 2.4166 2.3138 8.1776 6.1472 6.5790 6.0810 8.4852 1.0571 1.0343 1.1046 1.0980 1.0877 1.1026 1.0884 1.0917 1.0959 1.0879 1.1014 1.0922 1.0961 1.0641
irintensity: 0.0844 1.0050 0.1259 1.0641 6.7103 1.0218 3.8762 2.7444 0.0468 3.1607 0.1771 2.0469 3.9252 6.9604 3.4260 3.8238 3.1712 0.9191 1.4339 3.9726 18.7510 6.2393 48.3099 29.5247 28.5486 36.7415 28.8054 35.2579 8.5439 34.4882 37.3726 44.9328 44.4362 24.4161 34.9675 8.7930 9.7152 2.4453 12.6751 23.4398 206.7095 0.8026 145.0230 0.6367 0.3657 0.5995 0.2683 8.2389 138.0810 6.4125 187.6464 6.7811 46.9247 24.6181 0.2738 12.4813 44.0115 8.4330 9.7418 175.5365 261.4692 31.3520 145.6827 18.7376 18.5327 5.2864 42.2818 22.1078 33.8993 12.8882 73.7805 15.6204 0.4621 106.1388 29.7502 1.2745 124.9431 0.5624 334.3179 27.6451 73.2465 24.6791 30.3086 8.2061 14.8897 1.3181 19.9711 30.8340 11.2175 17.7042 2.2277 4.0476 49.8299
temp: 298.150 k
press: 1.00000 atm
elementType: 8 8 8 8 6 6 6 6 6 6 6 6 6 6 6 6 6 6 6 1 1 1 1 1 1 1 1 1 1 1 1 1 1
symmnumber: 1
zpe: 668430.3 jmol-1
zpe.correction: 0.254592 hartree
zpe.thermalcorrener: 0.272062 hartree
zpe.thermalcorrenthalpy: 0.273006 hartree
zpe.thermalcorrgfe: 0.206938 hartree
zpe.sumelectzpe: -879.509383 hartree
zpe.sumelectthermal: -879.491913 hartree
zpe.sumelectthermalent: -879.490969 hartree
zpe.sumelectthermalfe: -879.557037 hartree
dipole: -4.1809 -2.7956 1.3909
dipole: 5.2182
quadrupole: -106.9288 -103.9364 -110.6795
quadrupole: -10.5891 0.3096 -0.0663
quadrupole: 0.2528 3.2452 -3.4980 -10.5891 0.3096 -0.0663
hfenergy: -879.7639746 hartree
pointgroup: C01 [X(C15H14O4)]
dipole: -1.6033223 -0.7413911 1.0461856 debye
polarizability: 283.9813705|-19.8784766|145.5718653|-17.2647644|-36.9028826|121.5076276 unknown
InChI: InChI=1S/C15H14O4/c1-18-14-9-12(15(16)17)7-8-13(14)19-10-11-5-3-2-4-6-11/h2-9,16H,10H2,1H3
charge 0 multiplicity 1
33 atoms
O  -0.721116 0.140549 0.184833
O  0.877983 2.11726 -1.037527
O  5.435821 -1.734236 0.174984
O  5.684513 0.334304 -0.850579
C  -1.583916 -0.965095 0.659109
C  0.658027 -0.080199 0.128369
C  -3.027591 -0.551633 0.464125
C  1.439475 0.960602 -0.474238
C  1.297807 -1.250826 0.608553
C  3.461906 -0.396738 -0.145567
C  2.826379 0.785328 -0.608387
C  2.689841 -1.410993 0.47151
C  -3.993451 -0.871577 1.448852
C  -3.435588 0.114582 -0.718779
C  -5.354306 -0.543995 1.25034
C  -4.79303 0.451485 -0.911987
C  -5.75735 0.118918 0.068843
C  4.927045 -0.517891 -0.323192
C  0.030336 2.964276 -0.168337
H  -1.372669 -1.175993 1.72618
H  -1.342495 -1.871402 0.064712
H  0.71418 -2.044955 1.082513
H  3.417202 1.573294 -1.084689
H  3.183669 -2.315457 0.835329
H  -3.685204 -1.375042 2.373786
H  -2.684759 0.379406 -1.470809
H  -6.093833 -0.79739 2.017928
H  -5.099543 0.97087 -1.826745
H  -6.810769 0.378349 -0.084255
H  0.606807 3.305635 0.712934
H  -0.874054 2.423758 0.154559
H  -0.237594 3.827944 -0.795373
H  6.41838 -1.745538 0.022204
