program: Gaussian 09
title: 000226332
version: EM64L-G09RevD.01
frameworkgroup: C1[X(C14H20O4)]
method: RPBEPBE
basis: SDD
operation: Freq
keyword: #pfreq=noraman
keyword: PBEPBE/SDD
title: #p freq=noraman PBEPBE/SDD
converged: YES YES NO NO
title: Mulliken charges:
elementType: O O O O C C C C C C C C C C C C C C H H H H H H H H H H H H H H H H H H H H
charge: -0.355827 -0.207366 -0.289943 -0.458566 -0.015117 -0.381762 -0.383529 -0.563862 -0.715630 -0.724568 0.230992 0.332472 -0.043414 -0.330814 0.248790 -0.201133 -0.352436 -0.519480 0.199102 0.197558 0.218094 0.216773 0.205241 0.239689 0.244084 0.219614 0.203149 0.244222 0.220296 0.205855 0.231713 0.292600 0.230457 0.253805 0.402489 0.211439 0.265637 0.229378
chargesum: 0.00000
title: Mulliken charges with hydrogens summed into heavy atoms:
elementType: O O O O C C C C C C C C C C C C C C
charge: -0.355827 -0.207366 -0.289943 -0.056077 0.183985 0.033890 0.038485 -0.080089 -0.048645 -0.066704 0.230992 0.332472 -0.043414 -0.038214 0.248790 0.029324 -0.098631 0.186973
polarizability: 2.18619455e+02 -6.74570372e+00 1.82565007e+02 -1.19474531e+01 -3.41704390e+00 1.07563494e+02
1716.lowfreq: -11.1566 -0.0005 -0.0003 0.0004 1.0857 5.3416 17.4238 28.1777 42.5055
frequency: 14.9178 26.0696 42.4601 52.4770 60.9168 80.5716 103.3170 110.5615 139.9171 157.9597 172.6227 193.6612 223.6886 235.1350 240.4355 257.4283 261.1418 286.6437 306.8966 350.3169 365.5583 388.6725 439.6342 447.6795 461.3789 499.6591 505.9168 534.4697 555.0810 580.0483 586.4624 662.8282 711.4159 731.9799 758.5764 762.1468 771.4043 779.4623 814.8202 839.8599 870.9543 888.4281 920.2832 949.4869 956.4988 962.3143 999.4349 1021.4197 1046.2168 1054.0485 1065.6832 1071.9057 1106.5100 1113.6342 1130.5527 1152.6665 1162.7604 1165.1489 1168.3393 1216.9202 1224.5406 1240.0909 1243.5526 1258.0111 1277.1076 1279.3451 1304.8984 1344.8531 1349.4629 1352.3469 1390.9257 1392.5678 1400.1687 1428.3291 1444.2551 1454.1831 1456.7265 1466.1152 1473.7489 1475.7083 1477.1643 1480.8061 1483.8100 1494.5238 1499.9672 1590.1317 1608.9602 1654.5972 2952.3843 2969.6436 2973.3380 2976.1238 2978.7427 2979.1017 3020.2654 3027.1476 3035.7847 3058.4774 3069.4197 3073.6062 3082.5306 3089.6744 3096.1633 3131.7320 3150.1333 3174.6635 3217.8129 3498.5204
redmass: 5.2927 4.3139 4.2245 3.5476 2.3362 2.7260 3.3733 2.3252 1.8814 2.2531 2.6660 2.0008 3.8930 1.4934 3.3983 2.2551 1.8302 6.2021 4.9097 3.2597 3.3554 3.2596 4.8028 2.2496 2.9876 3.2356 1.1891 3.8774 4.9235 6.0413 5.6065 4.4593 3.1262 4.0484 2.6498 1.3176 2.4578 1.7472 5.2077 1.5049 2.2444 1.3821 4.3258 1.9583 1.2972 1.8357 3.6279 1.9269 1.4840 2.5061 1.9121 3.2876 1.5229 1.2382 2.2441 1.6076 2.0952 1.8244 1.5462 2.1444 1.5811 1.7040 1.6427 1.3328 1.7264 1.1260 1.2740 1.3967 1.3570 1.5655 1.2145 1.2222 5.7682 1.3766 2.1103 1.0847 1.0937 1.0815 1.0615 1.8370 1.0965 1.2506 1.0702 1.0532 1.0604 7.8108 6.5417 10.5892 1.0821 1.0369 1.0586 1.0380 1.0355 1.0605 1.1003 1.0975 1.0613 1.0990 1.0988 1.0993 1.1002 1.0965 1.1027 1.1052 1.0878 1.0959 1.0948 1.0642
irintensity: 0.9219 0.4455 0.1742 1.8961 4.6654 0.5016 0.9637 1.9384 0.1522 0.6788 4.5571 0.3287 6.7396 0.4287 1.8799 1.8594 0.5175 1.6234 2.2522 0.6485 10.5581 0.5697 4.4529 2.3296 0.4654 30.6069 100.8705 4.6277 6.8434 3.4968 2.2567 3.4701 14.9823 14.8044 2.5261 3.4006 15.3441 79.3695 23.9716 11.2677 2.0252 0.2617 25.5149 15.1113 3.3703 9.6333 54.3029 55.1885 50.7850 353.0794 50.4327 1.1732 9.6989 5.1000 193.1229 10.2956 25.3096 83.7232 0.9949 110.8857 36.4421 89.3122 79.9504 32.0393 8.2235 0.0959 11.3308 3.5276 2.7746 3.0683 19.6844 15.0643 0.3639 39.6708 70.9310 20.7984 13.4394 3.6597 4.9343 98.7396 18.9198 8.0785 23.7116 8.9234 9.6049 13.0353 31.7475 192.1905 20.9854 30.2146 9.9960 31.9368 75.6941 60.6301 0.2611 31.3047 18.8607 100.4285 44.6966 36.5507 52.7354 36.5383 9.1760 15.5595 8.3757 9.6066 2.0360 137.1211
temp: 298.150 k
press: 1.00000 atm
elementType: 8 8 8 8 6 6 6 6 6 6 6 6 6 6 6 6 6 6 1 1 1 1 1 1 1 1 1 1 1 1 1 1 1 1 1 1 1 1
symmnumber: 1
zpe: 823267.4 jmol-1
zpe.correction: 0.313566 hartree
zpe.thermalcorrener: 0.333385 hartree
zpe.thermalcorrenthalpy: 0.334330 hartree
zpe.thermalcorrgfe: 0.263330 hartree
zpe.sumelectzpe: -844.976398 hartree
zpe.sumelectthermal: -844.956578 hartree
zpe.sumelectthermalent: -844.955634 hartree
zpe.sumelectthermalfe: -845.026633 hartree
dipole: 2.0758 2.2782 -1.5675
dipole: 3.4578
quadrupole: -102.2594 -106.0321 -110.0004
quadrupole: 5.3473 3.3682 -2.4116
quadrupole: 3.8379 0.0652 -3.9031 5.3473 3.3682 -2.4116
hfenergy: -845.2899638 hartree
pointgroup: C01 [X(C14H20O4)]
dipole: 0.7935227 0.4009386 1.0297 debye
polarizability: 213.9363381|25.1727551|117.4987474|-1.0198189|-20.1272964|177.3128702 unknown
InChI: InChI=1S/C14H20O4/c1-4-10(5-2)9-13(15)18-12-8-6-7-11(17-3)14(12)16/h6-8,10,16H,4-5,9H2,1-3H3
charge 0 multiplicity 1
38 atoms
O  0.359229 0.915936 -0.277072
O  1.658948 1.368888 -2.183071
O  -3.927138 -1.286729 0.28652
O  -1.30278 -0.427986 1.277126
C  3.444951 0.182459 0.444859
C  4.084858 -0.504907 -0.792903
C  2.588818 -0.833619 1.24997
C  2.666057 1.492643 0.070266
C  5.052309 0.385705 -1.6028
C  2.066568 -0.313021 2.607002
C  1.56306 1.272929 -0.944514
C  -0.867945 0.548866 -0.927349
C  -1.729751 -0.138066 -0.02768
C  -1.229494 0.820239 -2.260653
C  -3.012523 -0.550124 -0.479276
C  -2.501834 0.383095 -2.697203
C  -3.38064 -0.285435 -1.820712
C  -4.149526 -0.89567 1.695154
H  4.27133 0.522925 1.106825
H  4.629765 -1.400248 -0.431711
H  3.284941 -0.878975 -1.463055
H  1.742549 -1.183809 0.625803
H  3.218589 -1.726932 1.433857
H  2.24083 1.941887 0.983451
H  3.374045 2.212914 -0.372681
H  5.571883 -0.208356 -2.376424
H  5.82537 0.835442 -0.950032
H  4.515312 1.199503 -2.120953
H  2.901992 0.010338 3.256212
H  1.392711 0.557866 2.490767
H  1.509377 -1.100925 3.145819
H  -0.540496 1.33301 -2.930859
H  -2.808812 0.574646 -3.730035
H  -4.368618 -0.621846 -2.148511
H  -0.391371 -0.047733 1.397451
H  -4.496906 0.153988 1.752665
H  -3.2330 -1.018899 2.292765
H  -4.942856 -1.571899 2.048084
