program: Gaussian 09
title: 000226331
version: EM64L-G09RevD.01
frameworkgroup: C1[X(C13H18O4)]
method: RPBEPBE
basis: SDD
operation: Freq
keyword: #pfreq=noraman
keyword: PBEPBE/SDD
title: #p freq=noraman PBEPBE/SDD
converged: YES YES NO NO
title: Mulliken charges:
elementType: O O O O C C C C C C C C C C C C C H H H H H H H H H H H H H H H H H H
charge: -0.303307 -0.258289 -0.492449 -0.418696 -0.018954 -0.394870 -0.398738 -0.311205 -0.710376 -0.717754 0.190443 0.270300 -0.475961 -0.354809 0.194994 -0.311316 0.153046 0.203324 0.197880 0.206014 0.206321 0.214900 0.228131 0.228018 0.211672 0.222406 0.218192 0.222179 0.220378 0.217187 0.265158 0.272322 0.258242 0.377132 0.388483
chargesum: 0.00000
title: Mulliken charges with hydrogens summed into heavy atoms:
elementType: O O O O C C C C C C C C C C C C C
charge: -0.303307 -0.258289 -0.115317 -0.030213 0.184371 0.009023 0.022482 0.144944 -0.058106 -0.058009 0.190443 0.270300 -0.210803 -0.082486 0.194994 -0.053074 0.153046
polarizability: 2.26895370e+02 1.02783024e+01 1.60510966e+02 -6.48656537e+00 5.84442199e+00 9.82163060e+01
1716.lowfreq: -21.9319 -10.1836 -2.1347 -0.0007 -0.0004 0.0004 6.3088 22.6854 47.6724
frequency: -12.8762 21.9796 47.5897 58.5683 77.5176 94.1549 120.3128 150.8273 164.2572 210.6975 216.4781 224.5834 244.9289 250.1594 280.8039 281.5999 286.3655 304.8181 333.0121 362.7138 419.6416 438.0268 466.0368 508.2850 516.6757 530.8947 560.8652 568.5698 629.9640 701.5421 730.2189 739.2008 760.4076 764.0476 778.9326 818.5625 838.9912 877.1517 884.8710 910.5788 931.3409 956.3478 971.6984 994.9261 1009.5012 1029.2280 1050.6029 1060.2396 1074.7546 1125.5635 1127.6242 1152.0906 1172.3550 1172.6957 1190.2399 1205.9940 1240.7461 1249.2515 1276.2916 1278.1346 1286.4452 1329.6625 1335.6740 1351.5228 1356.2108 1375.4368 1387.8882 1391.3734 1415.0661 1441.3165 1463.3341 1468.5489 1477.1556 1480.7057 1484.7433 1487.8685 1492.8407 1515.0853 1598.8212 1619.4633 1622.6911 2962.9172 2969.8716 2975.8581 2980.5512 2992.3297 3001.2114 3017.3642 3034.4092 3063.0438 3070.4499 3073.8713 3074.1891 3076.5127 3151.1133 3160.9684 3180.8392 3513.6980 3624.3514
redmass: 3.4711 4.0637 4.6931 5.7937 2.6214 4.5440 2.1173 3.5838 3.0480 1.6175 3.9686 1.9209 1.8302 2.5122 4.3945 2.6332 1.1653 2.5378 5.4947 6.5586 5.1045 3.0949 2.4730 3.2575 1.1028 2.9910 4.9965 6.0054 6.7957 5.5661 2.4139 3.7830 3.4089 1.4174 2.8189 1.6789 1.4179 1.5298 3.9385 2.0204 4.0682 1.7349 1.3486 1.9957 1.3671 1.7617 2.9988 2.6203 2.3439 1.8907 1.2436 1.9137 2.0757 1.4141 1.8666 1.1534 2.7888 1.2941 1.1290 1.6744 1.3707 1.4916 1.8667 1.5293 1.3949 1.5696 1.2202 1.2179 3.6455 5.8595 1.0666 1.0626 1.0516 1.0771 1.0456 1.0508 1.0686 3.4251 7.9107 7.2499 9.1815 1.0783 1.0606 1.0369 1.0364 1.0637 1.0574 1.1003 1.1003 1.1063 1.1000 1.0991 1.0997 1.1001 1.0920 1.0887 1.0972 1.0648 1.0666
irintensity: 1.1075 0.1165 0.3561 0.2437 0.0447 0.0236 0.1541 0.2100 1.5448 1.6304 0.0130 2.4412 2.0246 2.7326 5.8542 5.7082 175.6826 3.0624 3.0275 3.3103 17.4802 7.5027 2.2745 4.7929 141.9457 2.3404 1.4758 25.5633 7.9765 13.0862 5.0131 20.7542 17.7857 24.2686 8.6293 18.5696 19.1892 31.8906 2.7841 10.1422 57.1812 1.6074 0.5105 27.4863 4.6806 60.9784 182.9645 37.3736 199.1567 0.3042 37.5635 3.0266 4.9786 61.6249 633.2766 1.7084 56.9115 0.8989 26.3171 189.3960 72.3831 0.3993 2.7383 3.6278 2.4495 5.2673 15.1238 16.3386 15.3171 22.2460 1.1288 4.3942 8.1737 35.0126 1.8596 11.7491 5.3259 98.2873 201.9622 80.8930 72.0469 14.8577 28.5743 28.0541 28.4617 36.7739 23.9494 27.4218 21.7659 24.2055 64.4039 98.3983 32.6725 39.8291 4.1488 0.3844 5.4056 113.3787 50.3355
temp: 298.150 k
press: 1.00000 atm
elementType: 8 8 8 8 6 6 6 6 6 6 6 6 6 6 6 6 6 1 1 1 1 1 1 1 1 1 1 1 1 1 1 1 1 1 1
symmnumber: 1
zpe: 752151.2 jmol-1
zpe.correction: 0.286479 hartree
zpe.thermalcorrener: 0.303886 hartree
zpe.thermalcorrenthalpy: 0.304830 hartree
zpe.thermalcorrgfe: 0.240627 hartree
zpe.sumelectzpe: -805.782266 hartree
zpe.sumelectthermal: -805.764860 hartree
zpe.sumelectthermalent: -805.763916 hartree
zpe.sumelectthermalfe: -805.828119 hartree
dipole: 2.0237 -3.9916 -0.7085
dipole: 4.5311
quadrupole: -102.1380 -99.1115 -103.3962
quadrupole: 3.5162 -0.3045 1.3198
quadrupole: -0.5894 2.4370 -1.8476 3.5162 -0.3045 1.3198
hfenergy: -806.0687457 hartree
pointgroup: C01 [X(C13H18O4)]
dipole: 0.812509 -1.490271 -0.5447679 debye
polarizability: 227.0011602|11.0106121|156.2905347|-1.4343988|17.0442297|102.3309467 unknown
InChI: InChI=1S/C13H18O4/c1-3-9(4-2)8-17-13(16)10-5-6-11(14)12(15)7-10/h5-7,9,14-15H,3-4,8H2,1-2H3
charge 0 multiplicity 1
35 atoms
O  0.960195 0.388274 -0.162804
O  0.207687 2.476603 0.554896
O  -3.25907 -2.420101 -0.923487
O  -5.319356 -0.818276 -0.296102
C  3.306791 -0.247647 -0.443008
C  4.746176 0.323783 -0.585482
C  3.197056 -1.443469 0.545896
C  2.357142 0.902145 -0.074667
C  5.788387 -0.714668 -1.052597
C  3.693808 -1.164727 1.983318
C  -0.046116 1.302602 0.181451
C  -1.404593 0.717349 0.047432
C  -1.602327 -0.621061 -0.392534
C  -2.524052 1.528316 0.368434
C  -2.907013 -1.117034 -0.500964
C  -3.833133 1.021499 0.256604
C  -4.031441 -0.304034 -0.178992
H  2.995335 -0.618579 -1.44302
H  4.721876 1.159687 -1.314308
H  5.071318 0.766645 0.377462
H  3.761898 -2.299802 0.128784
H  2.136547 -1.759015 0.583121
H  2.455882 1.753215 -0.774231
H  2.527272 1.283508 0.948994
H  5.478805 -1.187148 -2.004059
H  5.929156 -1.518631 -0.307525
H  6.771817 -0.237792 -1.217327
H  3.13343 -0.34007 2.460822
H  4.766883 -0.900388 2.002855
H  3.560885 -2.060516 2.617014
H  -0.73131 -1.237042 -0.640187
H  -2.34556 2.554392 0.703626
H  -4.707619 1.631443 0.498983
H  -2.467695 -2.96615 -1.144681
H  -5.26346 -1.75831 -0.615818
