program: Gaussian 09
title: 000226327
version: EM64L-G09RevD.01
frameworkgroup: C1[X(C11H14O3)]
method: RPBEPBE
basis: SDD
operation: Freq
keyword: #pfreq=noraman
keyword: PBEPBE/SDD
title: #p freq=noraman PBEPBE/SDD
converged: YES YES NO NO
title: Mulliken charges:
elementType: O O O C C C C C C C C C C C H H H H H H H H H H H H H H
charge: -0.282662 -0.253804 -0.308477 0.105017 0.251274 0.253676 -0.369800 -0.377963 -0.210280 -0.376484 -0.030729 -0.539892 -0.528472 -0.556233 0.242027 0.249643 0.223688 0.230752 0.216276 0.235708 0.244171 0.219475 0.221832 0.219760 0.256732 0.226150 0.217418 0.221197
chargesum: 0.00000
title: Mulliken charges with hydrogens summed into heavy atoms:
elementType: O O O C C C C C C C C C C C
charge: -0.282662 -0.253804 -0.308477 0.105017 0.251274 0.253676 -0.127772 -0.128320 0.013408 0.070544 0.204979 0.145586 0.174170 -0.117619
polarizability: 1.51527020e+02 1.46770422e+00 1.26703868e+02 1.50320109e-01 -1.35520623e+01 1.06386274e+02
1716.lowfreq: -15.0479 -9.2094 -8.6606 -0.0008 -0.0004 0.0006 26.8035 43.2136 69.6768
frequency: 26.6656 43.0389 69.6692 74.5139 91.4602 108.8918 154.0470 168.4101 188.7052 219.3047 226.8467 274.9332 313.6794 332.1784 368.9256 374.8153 432.1273 458.1072 498.9868 553.8744 577.3109 614.0748 633.6405 657.8696 735.4986 774.0578 790.6185 854.8998 863.2812 884.6746 934.7714 950.6767 958.9371 960.7689 979.1748 1009.6147 1044.4570 1069.7727 1110.4184 1112.1238 1142.7294 1150.0860 1153.8695 1162.3484 1183.7616 1219.0161 1237.8164 1258.2008 1281.7601 1336.1923 1370.6601 1418.0588 1425.8909 1433.5834 1446.0338 1457.2650 1458.3267 1464.6330 1466.9325 1475.7200 1484.3673 1583.7055 1592.7212 1656.3200 2957.7811 2970.9261 2999.4533 3045.2627 3069.1963 3071.3841 3088.4498 3118.5446 3122.4524 3124.1370 3137.9377 3162.3552 3174.7659 3197.9522
redmass: 3.9433 3.9490 3.2558 2.3000 2.7068 3.9735 1.2299 2.5807 2.6882 3.2786 1.9198 1.8007 3.0521 5.3133 4.1490 3.5525 2.6198 5.7661 5.9843 3.6365 4.4442 4.6498 2.6091 2.6919 1.6261 4.9800 3.0633 3.1003 1.8920 3.0762 2.0958 1.3449 1.8103 3.1728 1.6196 1.2891 4.7294 2.2009 1.2594 1.2409 2.0528 1.4488 1.4373 2.0825 1.3366 1.7527 1.3121 3.4968 1.2501 1.2201 10.0578 1.3595 1.1917 1.2467 2.1336 1.4665 1.1864 1.2442 1.0509 1.1481 1.0672 6.6242 7.4551 4.5862 1.0330 1.0313 1.0580 1.1038 1.1029 1.1058 1.0602 1.1031 1.0952 1.0992 1.0865 1.0916 1.0984 1.1145
irintensity: 0.7415 1.0255 2.3004 1.0785 7.4011 5.0184 0.4791 6.9777 3.7991 1.1378 2.4800 0.5751 3.1563 6.0625 10.6939 2.1958 1.3914 3.2367 4.1255 4.4292 1.2095 3.3185 17.8180 1.4480 44.9727 10.6167 40.5900 10.3280 5.7143 46.7375 78.5074 1.1288 55.4561 39.9093 3.9312 25.1365 197.1521 67.1386 0.1572 4.5306 22.0941 2.1894 6.6751 26.6309 20.1500 51.4785 22.6524 89.5766 0.6191 0.8396 1.2269 34.9210 8.9992 19.3384 66.2635 87.2263 4.8700 23.1135 12.9201 9.5018 16.6490 38.6877 56.1197 3.1287 71.3090 77.9705 39.2381 47.6873 29.3271 10.9008 8.6906 23.4968 6.7464 23.3912 7.0704 12.6345 12.0232 22.1757
temp: 298.150 k
press: 1.00000 atm
elementType: 8 8 8 6 6 6 6 6 6 6 6 6 6 6 1 1 1 1 1 1 1 1 1 1 1 1 1 1
symmnumber: 1
zpe: 589737.6 jmol-1
zpe.correction: 0.224619 hartree
zpe.thermalcorrener: 0.239623 hartree
zpe.thermalcorrenthalpy: 0.240567 hartree
zpe.thermalcorrgfe: 0.181475 hartree
zpe.sumelectzpe: -652.097079 hartree
zpe.sumelectthermal: -652.082075 hartree
zpe.sumelectthermalent: -652.081131 hartree
zpe.sumelectthermalfe: -652.140222 hartree
dipole: 1.6173 -0.3482 0.1571
dipole: 1.6618
quadrupole: -67.3174 -78.8527 -84.2014
quadrupole: -1.5345 3.9575 0.2349
quadrupole: 9.4731 -2.0622 -7.4109 -1.5345 3.9575 0.2349
hfenergy: -652.3216978 hartree
pointgroup: C01 [X(C11H14O3)]
dipole: -0.2033006 -0.6209494 0.0230942 debye
polarizability: 130.7101231|10.7508324|144.8450812|-15.8933797|1.9891325|109.0619583 unknown
InChI: InChI=1S/C11H14O3/c1-4-8-14-11-9(12-2)6-5-7-10(11)13-3/h4-7H,1,8H2,2-3H3
charge 0 multiplicity 1
28 atoms
O  -0.446369 0.983888 1.161222
O  -1.311374 -1.602224 1.243283
O  1.780412 1.709575 -0.519364
C  0.228367 0.017054 0.385404
C  -0.19255 -1.344583 0.439054
C  1.349559 0.364499 -0.413396
C  0.501585 -2.329508 -0.307686
C  2.028783 -0.613996 -1.173973
C  1.598184 -1.954002 -1.116816
C  -1.262186 1.965728 0.370527
C  -2.414858 1.293604 -0.332029
C  -1.760122 -2.993503 1.336203
C  2.297617 2.299893 0.737307
C  -2.652421 1.403854 -1.662944
H  0.188973 -3.376995 -0.274654
H  2.879057 -0.303705 -1.788128
H  2.122426 -2.719065 -1.699589
H  -0.606263 2.499888 -0.342743
H  -1.616368 2.662985 1.150174
H  -3.067854 0.684221 0.307687
H  -2.626283 -2.967523 2.013604
H  -2.069246 -3.386974 0.347884
H  -0.971836 -3.643847 1.763205
H  3.208939 1.76184 1.061537
H  1.534351 2.261909 1.53456
H  2.547547 3.342733 0.488256
H  -3.510972 0.914689 -2.136764
H  -1.992498 1.987965 -2.316819
