program: Gaussian 09
title: 000226323
version: EM64L-G09RevD.01
frameworkgroup: C1[X(C11H12O3)]
method: RPBEPBE
basis: SDD
operation: Freq
keyword: #pfreq=noraman
keyword: PBEPBE/SDD
title: #p freq=noraman PBEPBE/SDD
converged: YES YES NO NO
title: Mulliken charges:
elementType: O O O C C C C C C C C C C C H H H H H H H H H H H H
charge: -0.284420 -0.419139 -0.213445 0.376616 -0.014354 0.245879 -0.587729 0.446125 -0.506387 -0.326750 -0.205114 -0.221742 -0.735944 -0.517930 0.244368 0.296726 0.230601 0.258606 0.163505 0.369305 0.234764 0.227771 0.228627 0.213146 0.262256 0.234658
chargesum: 0.00000
title: Mulliken charges with hydrogens summed into heavy atoms:
elementType: O O O C C C C C C C C C C C
charge: -0.284420 -0.049833 -0.213445 0.376616 -0.014354 0.245879 -0.343361 0.446125 -0.209661 -0.096149 0.053492 -0.058237 -0.044782 0.192129
polarizability: 2.09951658e+02 -1.06035960e+01 1.55629974e+02 -9.17262823e-01 1.34304645e+00 6.78695543e+01
1716.lowfreq: -4.9428 -0.0005 -0.0002 0.0004 1.3268 6.2521 60.6035 66.0028 82.2736
frequency: 60.5591 65.9710 82.2543 101.2656 116.9302 143.8816 157.3442 183.1591 203.2981 213.4835 263.0086 300.1046 314.1769 335.1224 347.5656 378.9784 394.2252 472.8528 525.2389 551.7251 575.7414 604.8578 660.3525 675.6893 752.1278 776.8583 818.6890 885.2895 893.2592 920.4427 923.1224 981.9407 991.9304 998.9919 1035.8204 1043.9031 1112.5599 1112.9267 1138.2189 1156.8362 1192.6556 1223.0767 1249.4478 1283.5626 1303.4207 1323.8536 1374.0826 1397.6231 1404.4242 1426.0639 1442.3138 1454.9963 1456.8721 1461.1561 1471.5412 1479.9583 1580.0511 1604.2348 1615.5122 1653.9373 2858.7302 2969.4679 2980.5131 3043.4097 3070.1349 3086.7375 3091.6816 3095.4754 3121.0661 3133.2553 3168.2463 3433.3821
redmass: 2.5049 3.0826 3.4270 2.2261 2.8020 1.5823 4.5124 1.7473 2.3710 2.5773 3.6787 3.1610 4.8590 5.2486 3.8531 5.9363 5.0321 5.0158 1.3306 5.1373 2.6525 3.6386 4.8610 5.3818 3.7534 5.3631 1.6776 2.0202 2.9916 1.9360 1.4296 1.3220 1.8543 2.0027 3.1060 1.5548 1.7015 1.6493 2.1060 1.4294 2.0904 1.8920 1.6158 1.3382 1.2970 3.4414 1.5817 1.2976 4.3242 1.6239 1.8648 2.0919 1.0517 1.2857 1.1255 1.0564 6.5950 6.3706 6.8586 5.7723 1.0845 1.0369 1.0348 1.0968 1.0925 1.0951 1.0973 1.0911 1.0912 1.1049 1.0922 1.0648
irintensity: 4.8485 2.1245 1.1379 1.5913 5.6115 3.5248 3.5701 3.3600 2.3662 0.7785 7.5793 3.5380 6.5946 3.2421 1.6766 1.7078 2.6004 13.0254 87.8200 15.1459 14.8288 20.5906 21.1580 17.0243 4.6172 9.3134 2.4683 43.2953 27.0829 7.1686 9.7777 27.1209 11.5175 21.8327 30.4510 0.9801 6.7853 5.8106 81.4470 19.8123 216.0285 17.2621 148.0067 14.7504 4.4564 116.1173 13.2649 18.5312 23.0841 2.4414 132.4205 25.3887 10.0348 17.9511 7.8312 23.2513 148.5908 43.7628 196.6948 2.6769 126.5930 34.9555 76.0585 18.6112 3.5431 5.8973 34.9207 49.7076 7.0180 14.4392 3.9542 69.8108
temp: 298.150 k
press: 1.00000 atm
elementType: 8 8 8 6 6 6 6 6 6 6 6 6 6 6 1 1 1 1 1 1 1 1 1 1 1 1
symmnumber: 1
zpe: 530672.9 jmol-1
zpe.correction: 0.202123 hartree
zpe.thermalcorrener: 0.216530 hartree
zpe.thermalcorrenthalpy: 0.217474 hartree
zpe.thermalcorrgfe: 0.160732 hartree
zpe.sumelectzpe: -650.967401 hartree
zpe.sumelectthermal: -650.952994 hartree
zpe.sumelectthermalent: -650.952050 hartree
zpe.sumelectthermalfe: -651.008792 hartree
dipole: -7.1053 0.0485 0.7809
dipole: 7.1483
quadrupole: -91.2055 -74.7994 -84.0577
quadrupole: 7.3315 0.4461 5.3020
quadrupole: -7.8513 8.5548 -0.7035 7.3315 0.4461 5.3020
hfenergy: -651.1695239 hartree
pointgroup: C01 [X(C11H12O3)]
dipole: -2.7334226 0.4508446 0.4841434 debye
dipolederiv: -0.3447936 -0.2506148 -0.0847595 -0.3444226 -1.5220534 -0.3220741 0.0058224 -0.1132093 -0.3842337 -0.7240407 0.5454673 0.0293329 0.5131685 -0.9082036 0.0690263 0.0160896 0.0255336 -0.325691 -1.2717537 0.5745797 0.0707223 0.1451549 -0.5187347 -0.0282598 -0.013657 -0.0065261 -0.3366833 0.0368056 -0.0156149 -0.0161566 0.308357 -0.286696 -0.0606414 -0.0962124 -0.0571863 -0.0129215 0.4194784 -0.7538075 0.00012 -0.4897519 0.6085198 -0.0735747 0.0870846 -0.0250071 0.0380417 -0.0296448 0.8213083 0.1826789 0.4861891 1.208548 0.1803154 0.0137519 0.0443731 0.026719 0.1938049 -0.2228133 -0.0179104 -0.1336468 0.0519912 0.0248087 -0.07377 0.0072045 -0.1695219 -0.4869272 0.3575268 0.0534164 0.5512714 -0.6365279 -0.0640709 0.1100683 -0.0876808 -0.0047446 -0.0206382 0.1022734 0.0121721 -0.2765104 -0.0369978 -0.0329937 -0.0645236 -0.0265285 -0.1334323 0.1969393 -0.0054909 -0.0030204 0.0372899 -0.0124711 0.175772 0.2473344 0.1483143 -0.0786065 0.2478556 0.0516886 -0.0461398 0.1533175 -0.164686 0.134973 -0.061617 0.15478 -0.0294851 1.4561698 -0.6420513 -0.0691273 -0.6110739 1.2079287 0.1500292 -0.0281751 0.1236258 0.1111013 -0.2267428 -0.0199727 0.019219 0.0759407 0.0796082 -0.0242584 0.0958937 -0.0114083 0.0510104 0.1414741 -0.2223601 -0.0583888 0.0848782 0.6975414 0.1901314 0.0532025 0.2942528 0.4601883 0.0780497 -0.0557258 -0.0132587 -0.0733298 -0.0509389 -0.0238232 -0.0101953 -0.0199989 0.1566875 0.0435216 -0.0549211 -0.0134088 -0.0046117 0.118364 -0.0021541 -0.0167407 -0.0175403 0.1635548 -0.0058081 -0.0302404 -0.0274164 -0.1057697 0.0091036 -0.1105503 -0.03946 -0.1006228 0.0675404 0.0251253 -0.0762651 -0.0409548 -0.1025278 0.0421134 -0.1082503 -0.0609205 -0.1033385 0.0366775 -0.0354307 -0.2167783 -0.0327124 -0.0492026 -0.2188309 -0.0476141 -0.0122747 -0.0445046 0.0987748 0.265681 -0.0347549 -0.0474235 -0.0178427 0.3295053 -0.0898407 -0.0195389 -0.0580094 0.2846359 -0.0154887 -0.022142 0.0675555 -0.1029851 0.0983578 0.0660173 0.0889136 0.0663146 -0.0787562 -0.0682386 0.0691389 -0.0128905 0.0885421 -0.0553775 0.0553581 -0.0982879 0.0422664 0.115059 0.0590274 0.0124935 0.0116893 -0.0807865 -0.0191997 -0.1172752 -0.0702553 -0.1209231 -0.0082683 0.089646 0.0740278 0.0181466 0.0110479 -0.0107404 0.0992795 -0.0331895 -0.0692567 -0.1872538 -0.0357329 0.1666373 0.0098885 0.0470893 0.0845191 -0.010009 -0.0386899 -0.0240837 0.0512155 0.0116612 -0.1515886 0.0086263 -0.1097849 -0.0946427 -0.0303209 0.0193467 -0.0208408 0.0883923 unknown
polarizability: 204.1879932|-18.3467924|157.9549087|-8.580847|17.1609153|71.3082842 unknown
InChI: InChI=1S/C11H12O3/c1-3-4-9-5-8(7-12)6-10(14-2)11(9)13/h3-7,13H,1-2H3
charge 0 multiplicity 1
26 atoms
O  1.747496 2.239374 0.102397
O  -1.088724 1.911527 -0.058738
O  3.636082 -2.558506 -0.311119
C  -0.82011 -0.543073 -0.151073
C  -0.272609 0.774764 -0.033326
C  1.142253 0.978308 0.043349
C  0.075353 -1.631412 -0.277791
C  1.476352 -1.43821 -0.226994
C  1.999945 -0.130882 -0.049881
C  -2.283126 -0.778962 -0.216741
C  -3.255672 -0.133417 0.497443
C  2.376139 -2.605937 -0.352506
C  -4.729501 -0.446964 0.4003
C  1.233126 3.233759 1.069139
H  -0.328151 -2.644772 -0.399311
H  3.082804 0.021207 -0.005359
H  -2.597877 -1.590222 -0.890095
H  -2.971629 0.6118 1.257533
H  1.847643 -3.584487 -0.493433
H  -2.018658 1.640452 -0.294943
H  -5.123992 -0.789814 1.376514
H  -5.316966 0.449305 0.120898
H  -4.929607 -1.234397 -0.347088
H  1.264398 2.82279 2.096519
H  0.206838 3.542169 0.815895
H  1.927593 4.0831 0.986211
