program: Gaussian 09
title: 000226321
version: EM64L-G09RevD.01
frameworkgroup: C1[X(C11H11NO3)]
method: RPBEPBE
basis: SDD
operation: Freq
keyword: #p
keyword: freq=noraman
keyword: PBEPBE/SDD
title: #p freq=noraman PBEPBE/SDD
converged: YES YES NO NO
title: Mulliken charges:
elementType: O O O N C C C C C C C C C C C H H H H H H H H H H H
charge: -0.263249 -0.290334 -0.198211 -0.020453 0.301517 0.248814 -0.504405 -0.325754 -0.241284 0.435189 -0.383388 -0.685466 0.264153 -0.265360 -0.745933 0.274368 0.222088 0.213691 0.259090 0.261693 0.213711 0.230747 0.240591 0.257662 0.247206 0.253316
chargesum: 0.00000
title: Mulliken charges with hydrogens summed into heavy atoms:
elementType: O O O N C C C C C C C C C C C
charge: -0.263249 -0.290334 -0.198211 -0.020453 0.301517 0.248814 -0.230036 -0.066665 0.194494 0.435189 -0.121695 -0.000416 0.264153 -0.265360 0.012252
polarizability: 2.02647868e+02 1.40036834e+00 1.36621111e+02 6.57643482e+00 6.32658549e+00 7.92056648e+01
1716.lowfreq: -7.8958 0.0001 0.0003 0.0006 1.0013 6.1304 46.1382 58.7959 61.9101
frequency: 46.1344 58.7952 61.9087 78.9099 100.3277 101.1525 108.4451 142.8527 174.8658 203.3985 247.9835 274.5778 301.5091 314.2239 332.9633 435.1143 449.3653 474.3471 480.0755 549.1672 560.3024 583.5279 607.0239 636.6607 678.4409 723.6751 757.3390 823.9605 830.6350 845.6947 861.7756 872.9549 954.9206 962.0349 986.5259 1031.8400 1039.6941 1104.5248 1117.0948 1134.9533 1144.8557 1162.2734 1196.8738 1260.7023 1264.5747 1274.0711 1362.6045 1383.4317 1384.1996 1401.7852 1406.2417 1452.6913 1453.3022 1462.1756 1474.5286 1485.6736 1495.6423 1580.5967 1603.4213 1695.6882 2177.9907 2966.0951 2999.4565 3009.0908 3028.4418 3097.0416 3099.7683 3109.6245 3144.7500 3162.6202 3175.0755 3182.8530
redmass: 5.0677 5.5717 3.1151 3.1678 1.2698 3.4126 2.3282 5.8503 5.4523 4.9050 1.2346 4.3024 5.2667 6.6836 3.6311 4.6664 5.7286 4.8656 5.3254 3.4657 5.6920 6.1165 5.9871 4.8686 4.7947 4.5654 3.9204 1.1467 1.8721 2.7106 4.3108 1.5776 1.3739 3.7138 2.1184 2.6345 1.6495 3.0893 2.1971 1.4366 1.8125 2.7848 2.0664 3.1477 1.1722 1.5987 1.6370 1.2883 2.8803 1.3118 4.2069 1.0481 1.0551 1.0395 1.1528 1.1626 2.1851 7.7500 6.6813 10.5401 12.6311 1.0557 1.0363 1.0373 1.1078 1.0989 1.0960 1.1018 1.1018 1.0888 1.0920 1.0979
irintensity: 1.3103 1.6593 3.0198 0.6171 1.5006 2.4093 5.9689 3.1805 3.2852 0.1677 0.8253 1.1230 3.6114 1.2785 0.4229 2.3103 4.7055 0.8306 1.4868 6.0914 11.2050 4.7805 4.8838 17.1058 1.7139 3.9241 1.3179 3.9654 35.9827 59.7333 45.9872 47.0402 0.6842 39.7601 98.6294 70.0269 7.7348 161.7654 30.5240 4.2841 71.0564 342.2631 1.0586 157.0997 8.1758 71.1624 10.8451 47.5731 26.2177 26.9285 56.7973 20.6422 25.7782 13.1499 40.6542 36.1051 74.3248 17.7959 35.1107 165.9975 45.7834 32.8507 18.3795 1.1093 25.1949 25.7636 5.5660 29.2599 9.3348 2.3744 3.6103 1.3387
temp: 298.150 k
press: 1.00000 atm
elementType: 8 8 8 7 6 6 6 6 6 6 6 6 6 6 6 1 1 1 1 1 1 1 1 1 1 1
symmnumber: 1
zpe: 515278.5 jmol-1
zpe.correction: 0.196259 hartree
zpe.thermalcorrener: 0.211426 hartree
zpe.thermalcorrenthalpy: 0.212370 hartree
zpe.thermalcorrgfe: 0.152938 hartree
zpe.sumelectzpe: -705.081274 hartree
zpe.sumelectthermal: -705.066108 hartree
zpe.sumelectthermalent: -705.065164 hartree
zpe.sumelectthermalfe: -705.124595 hartree
dipole: -4.7457 0.6499 -1.8034
dipole: 5.1182
quadrupole: -105.2830 -69.9000 -94.1126
quadrupole: -4.0963 1.2896 1.0720
quadrupole: -15.5178 19.8652 -4.3474 -4.0963 1.2896 1.0720
hfenergy: -705.2775333 hartree
pointgroup: C01[X(C11H11N1O3)]
dipole: 1.8813069 -0.2704466 -0.6651191 debye
dipolederiv: -0.802403 0.6991283 -0.021512 0.7117737 -1.3471385 0.0770249 -0.0494217 0.0683756 -0.2528006 -2.0511446 -0.3425508 -0.3462308 -0.1003838 -0.2898804 0.0745266 -0.3827013 -0.0004772 -0.5910083 -0.6150478 -0.099374 0.1416111 0.0817333 -0.2687633 0.1366132 -0.4179262 -0.012811 -0.9007615 -0.5156899 -0.0585734 0.0214224 -0.0906222 -0.243414 0.0039016 0.0395017 0.0035954 -0.2488017 0.5976842 -0.9398169 0.0231209 -0.7964107 0.6235099 0.0272141 0.0975939 0.0645424 0.1026553 1.1386961 0.2782254 0.0575925 0.5514869 0.0933418 0.0193984 -0.2807706 -0.0299329 -0.00761 -0.1404074 0.3660758 -0.0453423 -0.1524665 -0.081325 -0.0197293 0.033612 -0.0723077 -0.1813899 -0.1713084 -0.0172988 -0.0500047 0.0398105 0.065461 -0.0455082 -0.0342732 -0.0317488 -0.1007976 0.2438002 -0.0143209 0.0233095 -0.3482992 1.0499894 -0.0611364 0.0835095 -0.125168 0.3789072 -0.1164435 -0.1774165 0.0291576 -0.0382464 0.2592215 -0.0155501 0.0269551 -0.0072122 0.1226934 -0.0516111 -0.0223519 -0.0102706 0.0364964 -0.0762398 -0.0216096 -0.0302228 -0.0171032 -0.1686655 -0.0550666 0.0882034 -0.0150531 0.1131712 -0.0519874 0.0012057 -0.0217523 0.0160424 0.050063 1.9781088 0.3402381 0.1365825 -0.1746198 0.217539 -0.2391364 0.9053968 0.0423785 1.3534202 0.5171526 0.1555328 -0.0554477 0.1886739 -0.0190626 -0.0064851 -0.0790458 -0.0037944 0.0256654 -0.3920709 -0.081314 0.1312407 0.0076185 0.0282996 0.0072706 0.2048918 0.0376562 -0.098159 0.1039651 -0.0320108 0.0045059 -0.0202158 -0.0298653 0.0305339 0.0091583 0.0360044 0.1630505 0.0071522 -0.0457201 0.1003921 0.0724218 -0.0461501 -0.0210561 0.0755276 0.0477801 -0.0993639 -0.0438027 -0.1086026 -0.0957887 0.0238614 -0.0755365 -0.01535 -0.1139717 -0.039374 -0.03704 0.0883672 -0.0420717 0.0216539 -0.0474176 -0.0254781 0.0329261 0.0169822 0.0314319 0.1559626 0.0023036 0.0722782 -0.0024927 0.0664192 0.0383596 0.017032 0.0087966 0.0194964 0.169871 0.0688404 -0.0269725 0.0142212 0.01311 -0.1489638 0.056661 0.0044628 0.0615769 0.1043907 0.0317453 0.0274118 0.0670442 -0.0312666 0.1241837 0.0312877 0.0988303 -0.0036902 -0.0920409 -0.0011853 -0.0211756 -0.0756735 -0.0898737 0.0850176 -0.0828666 -0.0794969 -0.0705276 0.0008443 0.0860821 -0.0046165 0.0190225 0.0313487 0.0054976 -0.0898569 0.008382 -0.0852654 0.0723508 -0.0157977 -0.032548 -0.0590385 -0.0267353 0.1197884 0.005272 -0.1092954 -0.0167696 -0.0015946 0.108081 0.0396413 -0.0140225 -0.021368 -0.0064042 0.0974171 -0.0147225 0.087302 0.080159 unknown
polarizability: 202.7082667|2.4833371|135.3105816|-5.0212282|-10.9546052|80.4557953 unknown
InChI: InChI=1S/C11H11NO3/c1-3-14-11-6-9(7-12)4-5-10(11)15-8(2)13/h4-6H,3H2,1-2H3
charge 0 multiplicity 1
26 atoms
O  1.138651 -1.230843 -0.097668
O  1.680601 1.410124 -0.607381
O  2.388033 0.938426 1.584763
N  -4.828539 -0.514194 0.41815
C  0.050942 -0.365834 -0.095214
C  0.346725 1.007985 -0.34057
C  -1.29282 -0.747872 0.107922
C  -0.67523 1.967154 -0.410694
C  0.901667 -2.65067 0.256727
C  -2.326392 0.227862 0.045749
C  -2.020037 1.587184 -0.221297
C  2.262942 -3.337615 0.251062
C  2.670667 1.24325 0.416473
C  -3.693332 -0.17658 0.249708
C  4.033065 1.508948 -0.173448
H  -1.557439 -1.789264 0.306568
H  0.42792 -2.696753 1.257579
H  0.215776 -3.100387 -0.489709
H  -0.404236 3.007823 -0.610302
H  -2.821013 2.329324 -0.271499
H  2.145873 -4.405181 0.510994
H  2.731557 -3.271062 -0.745553
H  2.93605 -2.86929 0.988699
H  4.315423 0.664639 -0.827678
H  4.77547 1.610342 0.631033
H  4.015179 2.417485 -0.797314
