program: Gaussian 09
title: 000226320
version: EM64L-G09RevD.01
frameworkgroup: C1[X(C10H10O4S)]
method: RPBEPBE
basis: SDD
operation: Freq
keyword: #p
keyword: freq=noraman
keyword: PBEPBE/SDD
title: #p freq=noraman PBEPBE/SDD
converged: YES YES NO NO
title: Mulliken charges:
elementType: S O O O O C C C C C C C C C C H H H H H H H H H H
charge: 0.143272 -0.290530 -0.449222 -0.424189 -0.190330 0.512031 -0.563075 -0.532775 -0.382176 0.241536 0.174339 -0.349913 -0.308362 0.229828 -0.517828 0.254295 0.257195 0.271932 0.249280 0.216913 0.212636 0.264511 0.230609 0.362769 0.387254
chargesum: 0.00000
title: Mulliken charges with hydrogens summed into heavy atoms:
elementType: S O O O O C C C C C C C C C C
charge: 0.143272 -0.290530 -0.086453 -0.036935 -0.190330 0.512031 -0.051585 -0.260843 -0.132896 0.241536 0.174339 -0.132999 -0.308362 0.229828 0.189928
polarizability: 2.15166944e+02 -2.08025775e+01 1.40281151e+02 -5.17466096e+00 -1.21890798e+01 9.37192995e+01
1716.lowfreq: -13.1138 -6.7259 -4.3154 -0.0025 -0.0022 -0.0012 13.9608 26.2346 33.6697
frequency: 13.0032 25.8855 33.6016 51.4983 61.7862 118.0854 129.9504 182.9745 204.5928 242.0048 272.1997 303.2671 328.4385 341.1736 353.8014 366.6247 430.4981 455.7207 461.6878 496.6352 544.4268 574.1197 604.4646 625.2475 666.2260 698.8645 719.0192 742.9852 770.7641 798.8184 872.8537 889.3518 896.3763 924.7722 982.3555 998.4206 1061.5606 1081.5563 1112.2321 1148.4405 1158.1981 1160.5504 1163.0369 1223.8920 1229.6916 1265.1321 1268.6072 1286.3034 1301.0265 1393.3332 1410.1243 1441.1507 1444.9715 1455.1238 1478.6235 1497.9123 1592.5183 1608.9000 1639.9244 2980.1393 3018.7406 3088.4943 3091.0604 3109.9979 3132.1920 3148.0251 3162.8738 3513.1362 3578.8277
redmass: 5.1809 2.6176 4.4054 8.4116 7.1990 2.6775 2.4831 5.2769 4.0585 8.3266 4.6491 5.1496 4.4899 1.2251 3.1112 3.9021 3.9426 3.4059 4.6773 4.5267 5.2064 3.9560 1.7267 3.6547 3.8079 5.8476 4.0449 5.3339 3.7031 1.6748 3.2984 3.3991 1.5268 1.3496 4.0722 3.7750 1.8786 2.1533 1.2393 1.5833 1.6736 1.9362 1.4567 2.2386 1.7656 2.9546 1.9017 1.3738 2.0834 6.0994 2.3080 1.3950 1.1059 1.0676 1.0579 2.8523 6.5184 6.7197 9.7697 1.0348 1.0584 1.1035 1.0969 1.0887 1.1052 1.0953 1.0922 1.0642 1.0660
irintensity: 2.0242 3.7887 1.9040 1.6254 0.6248 1.1408 6.7540 1.7510 1.1669 0.5327 4.7449 7.0218 10.6608 109.4932 15.3426 15.3148 2.9892 6.2784 7.1331 4.8927 41.9648 4.8928 84.1194 35.4828 94.1882 7.9012 4.3731 28.0335 22.4807 21.2262 12.4701 9.3253 19.2267 3.2472 67.3209 175.1692 157.6564 48.6432 6.5111 92.9223 15.2994 15.3205 96.2978 74.4626 23.2242 251.1068 9.9585 21.7226 18.8187 0.3875 20.3678 6.4301 24.6751 21.0137 37.0981 112.5312 63.5722 17.7677 153.4539 80.6389 6.7646 3.2988 38.8965 17.2877 14.2536 5.4174 0.6555 32.6197 53.6691
temp: 298.150 k
press: 1.00000 atm
elementType: 16 8 8 8 8 6 6 6 6 6 6 6 6 6 6 1 1 1 1 1 1 1 1 1 1
symmnumber: 1
zpe: 475089.7 jmol-1
zpe.correction: 0.180952 hartree
zpe.thermalcorrener: 0.196333 hartree
zpe.thermalcorrenthalpy: 0.197278 hartree
zpe.thermalcorrgfe: 0.134858 hartree
zpe.sumelectzpe: -1084.874684 hartree
zpe.sumelectthermal: -1084.859303 hartree
zpe.sumelectthermalent: -1084.858359 hartree
zpe.sumelectthermalfe: -1084.920778 hartree
dipole: -3.0562 -0.3698 0.0471
dipole: 3.0789
quadrupole: -98.4319 -77.7733 -99.4004
quadrupole: 6.2463 -15.6969 -3.5105
quadrupole: -6.5633 14.0953 -7.5319 6.2463 -15.6969 -3.5105
hfenergy: -1085.0556365 hartree
pointgroup: C01 [X(C10H10O4S1)]
dipole: -1.1935303 0.2042207 0.0325966 debye
dipolederiv: -0.4130812 0.0844194 -0.0895211 0.4266819 -0.3398855 0.0466497 -0.2408622 0.0373584 -0.1189059 -0.872064 0.6923661 0.0163871 0.7394933 -1.1589249 -0.1053932 -0.0605431 0.0694998 -0.3311158 -1.5036852 0.055483 0.3136463 0.0394053 -0.142523 -0.1170423 0.4458053 -0.1391146 -0.4773819 -0.4710294 -0.0223397 0.0028226 -0.01568 -0.827946 0.5013171 0.0217865 0.3651029 -0.5899824 -0.4053802 -0.0493182 -0.139745 -0.2110104 -0.5634465 -0.1734096 -0.215189 0.0061552 -0.7816093 -0.0339215 -0.0712963 -0.0143965 -0.1400079 0.0369961 -0.0683181 -0.2511563 0.0468084 -0.0952361 -0.2867911 0.1105373 -0.1793132 0.2064745 -0.0282007 0.0592006 0.1042395 0.0026932 0.0145197 -0.0566604 0.1438955 -0.0810081 -0.1020522 -0.1046619 -0.0596648 -0.0366866 -0.1334177 -0.0838798 -0.059947 0.0546574 -0.0630307 0.0529444 -0.0832077 -0.0268726 -0.2018876 -0.0654642 -0.106484 0.1952893 -0.4390683 0.1015913 -0.9779595 1.071768 -0.0100143 0.4737088 -0.361931 -0.0168022 1.2872431 -0.1007299 -0.3712947 0.1693965 -0.1562456 0.0057562 -0.6422609 0.1828331 0.1789531 -0.2013512 -0.0473594 -0.0009733 0.2419044 0.0089812 -0.1260844 -0.0376915 -0.0640947 -0.0924833 0.800347 -0.2491938 0.3328564 -0.4726533 0.2230029 -0.0081352 0.5316038 -0.1881897 0.0993492 0.4939276 0.0786855 0.1674995 0.251875 1.1988344 -0.2730131 0.1447164 -0.1614296 1.1033045 0.5350578 -0.346672 -0.0373635 -0.2031101 0.4910278 0.1409409 -0.222704 0.3530256 0.3624426 -0.0069559 0.0148494 0.0292143 0.0049202 -0.0371171 -0.1067479 0.043957 -0.0341177 0.0516941 0.0736257 0.0150524 -0.0063297 -0.0377067 0.0514838 0.0876136 0.032726 0.0718604 0.0453581 0.1007315 -0.0485233 0.0655048 -0.0351309 0.0381276 0.0576626 0.0409376 0.0632969 0.1018283 0.0540765 0.1045607 0.0086588 0.0596536 0.0023895 0.0324131 -0.0206066 0.0453955 0.1167237 -0.0054248 -0.0642357 0.0939133 -0.049036 0.0076437 0.0877023 0.1163014 0.0950791 0.0808002 -0.0469049 -0.0228814 -0.1262332 0.023611 0.0313145 -0.0375063 0.0044231 -0.1791987 -0.1004842 -0.0470825 -0.0170372 0.0620736 -0.1188893 0.0924382 0.01432 0.1038217 -0.0645652 0.0492091 0.0751969 0.0745754 -0.0035415 0.1274425 -0.1294782 0.0561084 -0.0223278 0.0847913 0.0447923 0.425454 0.0444723 -0.0188865 0.0178088 0.0842704 0.115234 -0.0244281 0.0996797 0.337252 0.3693301 0.0051007 -0.062531 0.0016249 0.233359 -0.0927168 -0.0876835 -0.1320562 0.208138 unknown
polarizability: 197.3714573|-38.7825677|155.8004716|-8.0368406|-14.0241379|95.9954652 unknown
InChI: InChI=1S/C10H10O4S/c1-14-8-4-6(2-3-7(8)11)5-9(15)10(12)13/h2-4,11-12H,5H2,1H3
charge 0 multiplicity 1
25 atoms
S  3.61283 -2.269903 0.328051
O  -2.306011 1.85739 -0.691047
O  -3.60015 -0.214527 0.872896
O  2.788975 1.459254 -0.470429
O  3.296354 0.62074 1.638841
C  0.30538 -0.774264 -0.710903
C  1.701925 -0.984413 -1.312416
C  -0.395976 0.438031 -0.902831
C  -0.29235 -1.795854 0.069139
C  -1.684892 0.644837 -0.361317
C  -2.290398 -0.406249 0.38959
C  -1.580262 -1.609261 0.609118
C  2.745014 -0.932678 -0.211438
C  2.971684 0.413256 0.45256
C  -3.052818 2.583579 0.358796
H  1.772301 -1.963263 -1.814647
H  1.912197 -0.187372 -2.047825
H  0.044863 1.255442 -1.481806
H  0.243665 -2.734141 0.248471
H  -2.048814 -2.41078 1.196156
H  -2.394676 2.794538 1.223547
H  -3.932967 2.011152 0.690002
H  -3.355678 3.526912 -0.120251
H  -3.916565 -1.026355 1.341715
H  2.957468 2.32773 -0.013373
