program: Gaussian 09
title: 000241953
version: EM64L-G09RevD.01
frameworkgroup: C1[X(C14H27NO4)]
method: RPBEPBE
basis: SDD
operation: Freq
keyword: #p
keyword: freq=noraman
keyword: PBEPBE/SDD
title: #p freq=noraman PBEPBE/SDD
converged: YES YES NO NO
title: Mulliken charges:
elementType: O O O O N C C C C C C C C C C C C C C H H H H H H H H H H H H H H H H H H H H H H H H H H H
charge: -0.265772 -0.266698 -0.251495 -0.250274 -0.116481 -0.351039 -0.366611 -0.361033 -0.359422 -0.339356 -0.508823 -0.508343 -0.694530 0.255457 0.255089 -0.264597 -0.263741 -0.663440 -0.665153 0.197639 0.189010 0.235876 0.205555 0.233852 0.205659 0.205780 0.192041 0.193547 0.190282 0.244690 0.257352 0.241297 0.255987 0.212150 0.215369 0.211202 0.232998 0.222604 0.222892 0.233677 0.215692 0.227979 0.249236 0.217173 0.249457 0.227265
chargesum: 0.00000
title: Mulliken charges with hydrogens summed into heavy atoms:
elementType: O O O O N C C C C C C C C C C C C C C
charge: -0.265772 -0.266698 -0.251495 -0.250274 -0.116481 0.035610 0.074821 0.078477 0.038399 0.044473 -0.006781 -0.011059 -0.055809 0.255457 0.255089 0.191006 0.192827 0.029467 0.028742
polarizability: 2.01209677e+02 1.52570446e+00 1.89777292e+02 3.53540337e+00 -3.87179648e-01 1.36607241e+02
1716.lowfreq: -1.0429 -0.0010 -0.0008 -0.0005 3.4391 5.1668 16.9190 17.9702 23.5328
frequency: 16.4536 17.9214 23.4032 27.7891 33.0775 50.8817 54.4817 65.8672 69.5401 72.1146 98.8102 106.1547 118.2237 141.4178 146.8148 159.0168 189.5876 212.9215 213.9209 231.8706 246.6748 262.2586 287.4721 310.1794 323.0237 353.0431 373.8050 414.4639 435.6579 459.2095 482.8068 502.2280 571.0490 577.0189 657.1844 668.6140 732.5845 767.4174 780.0450 783.8761 786.6780 797.1542 814.5287 817.7076 852.1599 899.4732 901.8089 905.4856 929.9575 998.7183 1009.4007 1012.0006 1027.3755 1039.2482 1057.7776 1068.9628 1076.0814 1090.8616 1094.9283 1097.0428 1112.8745 1114.8700 1131.9126 1143.1084 1156.1041 1156.7599 1171.8158 1203.5382 1216.1313 1235.0011 1264.9059 1278.1855 1279.2896 1279.5958 1285.5119 1292.4697 1297.3936 1308.7534 1310.9870 1345.8969 1355.6811 1356.6959 1371.3269 1376.8519 1387.4805 1390.0698 1391.1354 1391.3923 1442.0447 1444.5488 1456.9384 1457.3268 1463.3234 1463.4106 1466.0871 1471.7902 1476.5462 1477.2982 1478.0378 1482.0541 1484.4083 1484.8904 1490.2688 1635.7568 1636.5153 2857.4155 2881.2825 2891.3339 2963.7806 2973.3871 2978.8413 2992.3624 2992.6167 3000.5478 3001.4767 3005.5377 3017.2842 3027.7491 3028.7303 3046.1454 3053.6149 3056.1706 3071.0589 3072.3025 3074.9197 3077.4683 3087.1174 3087.5667 3092.3154 3092.9254 3118.3351 3118.9051
redmass: 4.8376 4.3267 5.4481 3.5311 3.5442 3.3131 3.5735 2.0870 3.0608 2.1756 2.7093 2.7257 2.5498 2.7004 3.1260 2.5224 3.4646 1.3109 1.3414 1.2449 2.1488 2.3221 2.5457 2.7868 3.1370 3.4925 3.9257 3.1573 3.3971 3.2375 2.9577 2.9513 3.2137 3.1187 4.1831 3.7370 1.0766 2.6487 1.4501 1.3660 1.6056 1.3019 1.4268 1.6937 4.0669 1.7951 3.4442 3.3154 1.2556 2.8029 2.7623 2.8126 2.4944 2.8112 2.6695 3.0543 2.3438 2.2460 2.2015 2.1484 2.1433 2.3245 2.7505 2.3578 1.6782 1.6820 1.5530 1.5980 1.6787 1.4562 1.2307 1.2425 1.1164 1.1248 1.0973 1.1839 1.3514 1.4924 1.4523 1.5090 1.2844 1.2881 1.4027 1.4201 1.3736 1.2329 1.2636 1.2758 1.0882 1.0835 1.0938 1.0923 1.0430 1.0438 1.0711 1.0705 1.0885 1.0445 1.0805 1.0674 1.0516 1.0513 1.0896 8.8759 8.8777 1.0710 1.0720 1.0714 1.0587 1.0371 1.0599 1.0361 1.0361 1.0632 1.0626 1.0974 1.0894 1.0595 1.0596 1.1019 1.0888 1.0909 1.1007 1.0994 1.0960 1.0952 1.0973 1.0973 1.1034 1.1032 1.1058 1.1059
irintensity: 1.4080 0.1950 1.1015 0.0508 0.0121 0.0683 0.4589 0.3235 1.4010 0.3311 0.4553 1.6526 2.0311 3.1209 4.6976 0.5335 1.1302 5.1215 3.6744 0.0488 0.3357 3.2830 3.1558 16.7413 12.1967 5.3410 4.1785 5.0409 4.7332 8.5407 1.5409 3.9746 3.8150 4.3021 8.2189 15.1009 9.2023 5.2727 6.7338 13.6811 6.5328 0.4599 3.6353 3.5180 8.7775 19.2775 30.8030 10.3403 7.6419 10.8496 25.9281 53.3066 116.6736 41.4453 49.0170 19.6245 11.6530 64.4195 10.0913 23.6015 44.0804 17.3400 176.6958 292.3715 18.3521 24.5632 31.4609 2.3673 26.6057 5.6325 9.2771 10.6389 3.2536 3.0865 3.4947 3.3441 11.2755 102.3566 59.8675 0.7371 0.7869 0.5898 20.4354 52.6080 12.1220 18.9469 24.9807 6.8241 21.3511 17.2759 13.0837 11.9679 14.1101 14.3929 0.5303 1.6107 14.5901 9.4627 8.0900 4.0200 12.2419 13.9142 16.3734 127.8422 164.4564 63.4321 34.3359 135.1083 25.4521 31.6511 51.0085 20.4709 20.2433 7.6908 11.4933 8.7848 12.2972 33.9647 31.1571 44.3072 6.5616 1.8231 82.8477 55.3948 25.5526 34.3684 38.9079 35.8029 0.5719 0.6184 33.6681 34.2571
temp: 298.150 k
press: 1.00000 atm
elementType: 8 8 8 8 7 6 6 6 6 6 6 6 6 6 6 6 6 6 6 1 1 1 1 1 1 1 1 1 1 1 1 1 1 1 1 1 1 1 1 1 1 1 1 1 1 1
symmnumber: 1
zpe: 1040119.5 jmol-1
zpe.correction: 0.396161 hartree
zpe.thermalcorrener: 0.420282 hartree
zpe.thermalcorrenthalpy: 0.421226 hartree
zpe.thermalcorrgfe: 0.336667 hartree
zpe.sumelectzpe: -903.776483 hartree
zpe.sumelectthermal: -903.752362 hartree
zpe.sumelectthermalent: -903.751417 hartree
zpe.sumelectthermalfe: -903.835977 hartree
dipole: 1.4153 -0.2900 0.7602
dipole: 1.6325
quadrupole: -101.4790 -114.2037 -117.3124
quadrupole: 7.1859 -1.7641 -3.7108
quadrupole: 9.5194 -3.2053 -6.3140 7.1859 -1.7641 -3.7108
hfenergy: -904.1726432 hartree
pointgroup: C01 [X(C14H27N1O4)]
dipole: 0.5615185 0.0995805 -0.2954354 debye
polarizability: 201.4222894|-1.3895946|189.0876597|-1.6609497|-5.7310875|137.0842611 unknown
InChI: InChI=1S/C14H27NO4/c1-4-7-10-15(11-8-13(16)18-5-2)12-9-14(17)19-6-3/h4-12H2,1-3H3
charge 0 multiplicity 1
46 atoms
O  -3.619101 1.956415 -1.236358
O  4.600496 0.782245 -0.212959
O  -4.182785 0.082621 0.037005
O  2.962385 2.28294 0.504477
N  0.044415 -0.932499 0.228305
C  0.3282 -2.280858 0.792202
C  -1.35792 -0.498321 0.449361
C  1.036502 0.092416 0.638692
C  -0.207183 -3.430798 -0.08663
C  0.058557 -4.822784 0.531575
C  -1.83845 0.452713 -0.666465
C  2.332741 -0.006123 -0.193051
C  -0.464577 -5.976405 -0.351276
C  -3.318611 0.773622 -0.553587
C  3.282749 1.145921 0.083298
C  -5.055196 2.379498 -1.245119
C  5.638599 1.851109 -0.064094
C  -5.379955 3.214587 -0.00337
C  5.721662 2.70752 -1.330768
H  1.42584 -2.392009 0.880511
H  -0.081077 -2.382503 1.82974
H  -2.012429 -1.38612 0.448801
H  -1.493392 -0.010292 1.445126
H  0.606473 1.096505 0.480979
H  1.281431 0.026407 1.726962
H  0.266496 -3.360534 -1.085263
H  -1.297266 -3.309152 -0.247641
H  -0.417454 -4.87718 1.532114
H  1.148234 -4.949533 0.698173
H  -1.268976 1.398051 -0.688454
H  -1.661477 -0.039155 -1.643095
H  2.866536 -0.958457 -0.031919
H  2.058665 0.01961 -1.266114
H  -1.556684 -5.891726 -0.506565
H  -0.263853 -6.961606 0.108366
H  0.016965 -5.962771 -1.347175
H  -5.68802 1.475956 -1.297561
H  -5.146668 2.964754 -2.174132
H  6.566749 1.285538 0.115869
H  5.385873 2.464154 0.81895
H  -6.418369 3.589993 -0.066469
H  -4.703081 4.082798 0.075247
H  -5.28937 2.605367 0.911433
H  6.549136 3.435212 -1.236335
H  4.785553 3.270089 -1.484188
H  5.913636 2.080389 -2.218499
