program: Gaussian 09
title: 000226318
version: EM64L-G09RevD.01
frameworkgroup: C1[X(C10H9NO6)]
method: RPBEPBE
basis: SDD
operation: Freq
keyword: #p
keyword: freq=noraman
keyword: PBEPBE/SDD
title: #p freq=noraman PBEPBE/SDD
converged: YES YES NO NO
title: Mulliken charges:
elementType: O O O O O O N C C C C C C C C C C H H H H H H H H H
charge: -0.282917 -0.389461 -0.171032 -0.269126 -0.429213 -0.248385 0.024559 0.633401 0.325917 0.277416 0.017318 -0.597075 -0.531018 -0.277532 -0.303529 -0.506636 0.156125 0.294804 0.265802 0.275343 0.251769 0.376055 0.219457 0.268256 0.238310 0.381392
chargesum: 0.00000
title: Mulliken charges with hydrogens summed into heavy atoms:
elementType: O O O O O O N C C C C C C C C C C
charge: -0.282917 -0.013406 -0.171032 -0.269126 -0.047821 -0.248385 0.024559 0.633401 0.325917 0.277416 0.017318 -0.302271 -0.265216 -0.002189 -0.051760 0.219387 0.156125
polarizability: 2.77711653e+02 8.14825510e+00 1.78653524e+02 6.13256683e-01 -3.01688605e+00 5.92558727e+01
1716.lowfreq: -5.1545 -0.0007 -0.0004 0.0008 2.7749 6.6312 36.3672 37.1884 59.1199
frequency: 36.3068 37.1849 59.1164 67.5073 79.2168 116.8311 143.7386 152.8140 184.4445 199.7401 214.5632 236.1145 252.7467 320.3040 361.3823 384.6339 395.9918 427.1343 457.8605 491.2865 513.0961 522.1465 572.4442 618.7662 624.5479 665.9549 683.6873 705.4246 717.7898 728.9334 794.0680 865.6308 877.4115 885.7931 910.3675 915.3316 922.3596 939.7757 1013.5951 1032.3374 1055.4174 1109.8703 1122.3245 1130.8088 1159.2589 1199.4798 1225.8177 1250.0752 1279.8029 1307.9475 1320.0328 1343.0808 1373.8072 1419.4676 1443.4417 1451.1564 1457.2040 1471.1685 1486.9031 1583.8361 1606.5979 1630.7772 1653.8289 2799.6996 2994.6728 3108.0102 3108.9693 3145.9665 3164.3685 3171.4211 3174.8179 3525.3094
redmass: 2.0810 7.6007 9.3879 7.4175 3.9437 5.4163 2.1095 3.4251 5.1801 7.3403 4.2683 3.8955 5.8986 5.0197 5.4478 7.4225 4.7573 7.7568 7.0386 5.1235 5.4740 6.0806 1.6571 3.8870 2.4600 4.9303 6.6083 5.1221 11.0310 4.9830 6.0601 8.0212 1.7814 1.0750 1.5706 1.5355 7.7259 4.8620 1.2010 3.3785 2.1620 1.2409 3.1668 3.1240 1.5266 1.9457 1.4272 2.1514 2.3794 2.1718 2.0986 2.8952 3.6856 3.0508 1.4590 2.6685 1.0866 1.0830 4.1901 3.8168 6.9044 8.4059 5.7914 1.0674 1.0336 1.0905 1.0986 1.1061 1.0925 1.0908 1.0927 1.0641
irintensity: 5.2855 0.4240 0.6192 0.0431 1.2513 1.5315 3.6341 3.0448 1.5968 4.6187 0.5570 0.9792 1.2624 8.0383 11.8244 6.3056 0.8012 1.9423 10.4723 6.8039 0.3925 74.0699 53.8127 35.0148 72.3614 2.7667 3.2496 19.6410 8.7646 10.3188 0.6339 21.2853 30.0994 143.2663 2.5723 2.1670 20.3038 3.6632 56.3050 138.9199 572.8814 4.7533 59.7002 219.5886 8.1314 30.2981 14.5967 14.3352 210.8911 236.0810 222.5606 97.4028 169.7430 13.5074 44.6577 103.7546 10.8907 55.2979 116.0287 36.2591 91.6782 350.4318 126.1841 258.4293 66.5346 0.7760 32.5771 9.6272 5.1208 3.5373 7.9728 63.5715
temp: 298.150 k
press: 1.00000 atm
elementType: 8 8 8 8 8 8 7 6 6 6 6 6 6 6 6 6 6 1 1 1 1 1 1 1 1 1
symmnumber: 1
zpe: 474939.7 jmol-1
zpe.correction: 0.180895 hartree
zpe.thermalcorrener: 0.196913 hartree
zpe.thermalcorrenthalpy: 0.197857 hartree
zpe.thermalcorrgfe: 0.135670 hartree
zpe.sumelectzpe: -891.220926 hartree
zpe.sumelectthermal: -891.204908 hartree
zpe.sumelectthermalent: -891.203964 hartree
zpe.sumelectthermalfe: -891.266151 hartree
dipole: -0.2388 3.9864 0.8875
dipole: 4.0910
quadrupole: -99.0118 -105.3946 -98.3820
quadrupole: -5.1925 -2.5371 4.0765
quadrupole: 1.9177 -4.4651 2.5474 -5.1925 -2.5371 4.0765
hfenergy: -891.4018207 hartree
pointgroup: C01 [X(C10H9N1O6)]
dipole: -0.0639269 -1.5550239 0.4102833 debye
dipolederiv: -0.5067369 0.4830004 -0.0537672 0.6779712 -1.5014184 0.1791834 0.0004091 -0.0560533 -0.3326955 -1.3876415 0.3472816 0.0280218 0.1736041 -0.5282898 0.0031741 0.052479 -0.0083469 -0.3367228 -0.3533876 0.0696206 0.0067222 -0.2766625 -1.0347873 -0.0200074 0.0010909 -0.0281541 -0.2010884 -1.09806 -0.1201353 0.0102569 0.1128692 -0.4433701 -0.0017712 0.0091343 -0.0091844 -0.2749862 -1.3234272 -0.5351037 -0.0316061 -0.6699317 -0.6373208 -0.0192299 -0.02931 -0.0145114 -0.4359551 -0.9641565 0.1854288 -0.0114258 0.4571823 -0.9389259 -0.001703 -0.0028291 -0.0088022 -0.3315671 1.5369273 0.4652601 -0.011118 0.6425495 1.6160958 0.0379055 -0.0084414 0.0430936 0.20671 -0.3215605 -0.1041858 -0.0040548 -0.0992952 -0.2354055 -0.006239 -0.0127686 0.0049471 0.029143 -0.6015642 -0.5332824 -0.0026281 -0.2736628 -0.6199128 -0.0111714 0.0023255 -0.014481 0.0570044 -0.3956096 -0.055026 -0.0701562 -0.8013704 1.5539698 -0.0871907 -0.1005594 0.1261559 0.0482616 1.2097242 -0.5841964 -0.0303995 0.1826905 0.172586 0.0201135 -0.0162767 -0.0361808 0.0719754 0.3399707 0.3708871 0.0062897 0.0948734 -0.12597 0.0135646 0.004574 0.0076313 -0.1442713 -0.0161672 0.1631551 -0.0096702 -0.0115232 0.0448593 0.0343527 -0.011918 0.0614682 -0.1244335 1.0354173 -0.1111337 0.0229845 0.0761873 0.0746178 0.00732 0.0187397 -0.0028385 -0.0808007 -1.4689809 0.0986362 -0.0275667 -0.045519 0.0699401 0.0041473 -0.0224168 0.006163 -0.1783009 0.5049518 -0.497709 0.1194467 -0.226408 0.5485725 -0.107286 0.1426952 -0.2056897 0.3787469 2.6478315 0.1540422 0.0572338 -0.2871543 1.2819929 0.0140402 0.041378 0.0241819 0.2433581 0.1063974 0.0017427 -0.0010771 0.0608168 0.0641137 -0.0015531 -0.0057629 -0.0050411 0.17411 0.056287 -0.0902947 0.0021772 -0.045782 0.055882 -0.0015786 0.0030162 -0.0013365 0.1496472 0.0800171 -0.0196017 -0.0022793 0.0334716 -0.0178361 -0.0022024 0.0001143 -0.003869 0.1551872 0.1015808 0.0375585 -0.0000467 0.0771335 -0.0473501 -0.0024377 -0.0011262 -0.0028885 0.1733845 0.478676 0.0348753 -0.0039645 0.0005868 0.4197182 0.0035396 -0.0122526 0.0112287 0.3627133 0.0106128 0.1114462 0.0063603 0.0151675 0.0505792 -0.0877216 -0.0551027 0.0579256 -0.1608788 -0.0760981 0.0658996 0.0257945 -0.0737732 0.1439744 0.0284331 0.0326261 0.0575712 0.0469413 0.0881366 -0.0443541 -0.0263084 0.0285519 -0.1670824 0.0042624 -0.0311222 -0.0013296 0.1032973 0.3168595 0.1061885 0.0007809 0.1774265 0.2007673 0.0000554 0.0013041 -0.0016596 0.4012202 unknown
polarizability: 278.264693|-1.3001245|178.0602283|4.5754228|-1.7147794|59.2961281 unknown
InChI: InChI=1S/C10H9NO6/c1-17-8-5-6(2-3-9(12)13)4-7(10(8)14)11(15)16/h2-5,12,14H,1H3
charge 0 multiplicity 1
26 atoms
O  1.107082 -2.97542 -0.08056
O  3.272432 -1.053226 -0.040539
O  2.323797 3.019523 0.096694
O  3.905066 1.381964 0.027526
O  -5.64319 -0.452743 -0.109041
O  -4.901832 1.756074 -0.050661
N  2.636942 1.779297 0.055168
C  -0.783435 0.217937 -0.002865
C  1.598557 0.757541 0.039008
C  0.90826 -1.600728 0.004115
C  1.970269 -0.6309 0.00799
C  0.248738 1.177293 0.031424
C  -0.425935 -1.166855 -0.008109
C  -2.174932 0.680037 -0.020095
C  -3.299248 -0.098147 -0.056502
C  2.224447 -3.622104 0.650351
C  -4.634764 0.528109 -0.070073
H  0.031857 2.24894 0.049202
H  -1.193182 -1.946351 -0.024504
H  -2.330741 1.768402 -0.002134
H  -3.276766 -1.191629 -0.078545
H  3.857384 -0.199098 -0.033656
H  2.201566 -3.3390 1.718817
H  3.194644 -3.350844 0.210024
H  2.026452 -4.698496 0.541325
H  -6.530767 -0.002675 -0.118461
