program: Gaussian 09
title: 000226317
version: EM64L-G09RevD.01
frameworkgroup: C1[X(C10H9NO4)]
method: RPBEPBE
basis: SDD
operation: Freq
keyword: #p
keyword: freq=noraman
keyword: PBEPBE/SDD
title: #p freq=noraman PBEPBE/SDD
converged: YES YES NO NO
title: Mulliken charges:
elementType: O O O O N C C C C C C C C C C H H H H H H H H H
charge: -0.262072 -0.248484 -0.232741 -0.226365 0.036172 0.188213 0.173273 0.528287 -0.451239 -0.344408 -0.408843 -0.203229 -0.381909 0.324078 -0.811852 0.270987 0.260734 0.244203 0.245571 0.246811 0.280025 0.290133 0.241334 0.241321
chargesum: 0.00000
title: Mulliken charges with hydrogens summed into heavy atoms:
elementType: O O O O N C C C C C C C C C C
charge: -0.262072 -0.248484 -0.232741 -0.226365 0.036172 0.188213 0.173273 0.528287 -0.180252 -0.083674 -0.164640 0.289153 -0.101884 0.324078 -0.039063
polarizability: 2.87296361e+02 -9.43617167e+00 1.35162624e+02 -5.37497300e-02 -2.03887294e-02 5.89593486e+01
1716.lowfreq: -16.5200 -2.6183 -0.0006 0.0005 0.0006 2.3493 12.1083 31.2766 53.9350
frequency: -8.1787 31.2537 53.9263 71.5044 103.9735 188.4195 199.3708 219.9154 239.4561 277.7478 340.7870 378.1818 409.9489 422.6858 475.8780 516.4699 531.8192 606.6761 612.5770 668.3653 680.8159 684.0743 727.4962 761.4801 796.0576 801.3208 818.2346 836.7405 870.8293 916.7596 936.8747 970.8031 975.9123 989.8306 1038.7733 1063.2320 1064.3012 1105.1281 1120.0042 1143.1814 1171.6779 1208.1519 1267.2342 1277.2594 1350.1344 1359.9924 1368.5666 1396.3488 1413.7400 1455.9779 1468.6321 1480.8509 1488.5830 1489.7414 1595.2658 1619.9139 1638.2227 2983.0893 3022.9755 3061.5833 3105.4288 3117.3392 3119.6552 3149.4406 3187.5301 3222.2772
redmass: 3.6215 2.3125 8.8823 6.5365 6.5151 1.5962 3.0827 9.7417 3.7697 5.0060 5.8134 3.9457 3.0295 5.7055 3.0823 7.3238 7.2381 7.0204 3.7425 5.2922 9.7964 7.7961 3.7716 6.8522 6.4919 6.0997 1.3648 10.2904 1.4947 4.2640 1.3374 4.5461 1.4403 2.3093 1.4299 3.6420 1.4704 1.9354 1.0375 1.4634 12.6667 1.7524 2.6143 1.7016 4.7205 2.0180 1.5284 1.9336 1.6263 3.0217 1.1730 1.6350 1.7941 1.0470 7.7637 8.0149 8.4115 1.0393 1.0538 1.0989 1.1189 1.0874 1.0947 1.0900 1.0960 1.0915
irintensity: 1.7428 11.9918 3.1810 2.0786 1.1542 0.5744 0.0929 1.4638 1.3546 4.7107 0.0997 3.6207 2.1848 2.0136 3.7544 3.8688 13.5463 3.0303 18.4801 4.8536 0.2160 4.2021 3.1565 4.9322 25.8049 37.6887 37.4902 32.3374 21.6044 7.5962 6.6863 216.3110 19.1113 12.4317 2.3774 35.2624 4.5552 40.2430 0.0960 23.3502 775.2994 78.1303 107.0675 104.9192 102.1330 77.3486 29.6530 14.6949 11.9119 154.7036 20.3965 33.8895 89.1049 21.8884 24.1739 83.2788 87.0237 12.0749 123.7320 12.7943 25.5672 0.5861 1.4848 3.2532 3.9742 2.7356
temp: 298.150 k
press: 1.00000 atm
elementType: 8 8 8 8 7 6 6 6 6 6 6 6 6 6 6 1 1 1 1 1 1 1 1 1
symmnumber: 1
zpe: 458590.9 jmol-1
zpe.correction: 0.174668 hartree
zpe.thermalcorrener: 0.187028 hartree
zpe.thermalcorrenthalpy: 0.187972 hartree
zpe.thermalcorrgfe: 0.134514 hartree
zpe.sumelectzpe: -740.905655 hartree
zpe.sumelectthermal: -740.893295 hartree
zpe.sumelectthermalent: -740.892351 hartree
zpe.sumelectthermalfe: -740.945809 hartree
dipole: -7.2016 -1.0925 0.0474
dipole: 7.2842
quadrupole: -105.8131 -82.1663 -86.9932
quadrupole: -0.5223 -0.3313 -0.0754
quadrupole: -14.1556 9.4913 4.6643 -0.5223 -0.3313 -0.0754
hfenergy: -741.0803229 hartree
pointgroup: C01 [X(C10H9N1O4)]
dipole: 2.8260342 0.4070761 0.2465042 debye
dipolederiv: -1.1472406 -0.2712944 -0.2193371 -0.5292322 -0.4815818 -0.1956505 -0.4549744 -0.2082476 -0.4257474 -1.8093079 -0.2411483 -0.1444967 -0.3930407 -0.3952253 -0.1293281 -0.2662504 -0.134405 -0.3639837 -0.7291951 -0.1192479 -0.0831887 -0.4804207 -0.5274146 -0.2514843 -0.4313651 -0.2743608 -0.4712544 -1.1620866 0.1845112 0.2359281 0.2497088 -0.425042 -0.1931026 0.2988998 -0.1891698 -0.4416398 2.5483713 -0.055551 -0.2040357 0.490749 0.5970809 0.3776918 0.3223086 0.4122 0.5496152 0.1410212 0.2973753 0.2803484 0.9819773 0.3270159 0.2073536 0.9477394 0.2477304 0.2385065 1.6693696 0.2666588 0.1591355 -0.0355444 0.0250836 -0.0324679 -0.1546194 -0.0521079 0.0126004 -0.752086 0.0272702 0.0746975 -0.0169955 0.0318351 0.016878 0.0372106 0.0158384 0.0262616 0.1697463 -0.0972463 -0.1144126 0.1227816 -0.0990976 0.0473016 0.0984176 0.0601826 -0.1009117 -0.3497713 -0.0367062 -0.0223068 -0.285637 -0.0457084 0.122013 -0.2719666 0.1065951 -0.0287792 0.3054478 -0.0094662 -0.0416606 -0.1475703 -0.0748329 0.0991025 -0.1712006 0.0895509 -0.0673901 1.1248468 0.1727004 0.1553394 0.3715875 0.6116167 0.032417 0.3538228 0.0453946 0.5928963 1.3129756 -0.0441367 -0.1309707 -0.2728476 -0.0927628 0.0138396 -0.3571057 -0.0007915 -0.0672272 -1.609427 0.0619585 0.1588324 0.0418856 0.1403377 0.1676445 0.1428656 0.1680471 0.1148494 -0.0059767 -0.0488636 -0.0411569 0.0458887 -0.0537754 -0.136003 0.0513388 -0.1309997 -0.0430572 0.1219997 0.0271127 0.0296118 0.0100528 0.0786361 -0.0775439 0.0120697 -0.078894 0.0786326 0.046159 0.0413028 0.0492644 0.0454791 0.0952371 -0.086484 0.0526422 -0.0861121 0.092534 0.0364713 -0.07679 -0.0668629 -0.0450916 0.0728625 -0.082859 -0.0354867 -0.0808036 0.0835243 -0.0747267 -0.0036342 -0.0768558 0.0381901 0.035674 0.0697208 -0.1876 0.0250657 -0.0543013 -0.0616538 -0.0762987 0.0000807 -0.175779 -0.0568783 0.0324017 0.0316507 0.0681297 0.0396699 0.0938954 0.0048026 0.0085357 -0.0114046 0.077281 -0.0723731 -0.0100403 -0.0736864 0.0825219 0.0149661 0.1044764 0.1052752 -0.00977 0.1412663 0.0082798 -0.0044323 0.0016204 0.1355332 0.0643946 -0.1244003 0.0199772 -0.0492321 -0.0223895 0.0185327 0.051649 0.0565531 0.0344327 0.0518072 0.0166149 -0.1317416 0.0542653 0.0407815 0.0441196 -0.0555733 0.0126706 -0.0172861 unknown
polarizability: 287.0484377|1.6299608|97.7808844|-12.5776075|37.7715373|96.589012 unknown
InChI: InChI=1S/C10H9NO4/c1-7(11(12)13)4-8-2-3-9-10(5-8)15-6-14-9/h2-5H,6H2,1H3
charge 0 multiplicity 1
24 atoms
O  2.950707 1.129263 1.165642
O  4.094456 -0.342573 -0.3497
O  -4.166644 -1.296836 -0.73328
O  -4.875481 0.237694 0.789886
N  -3.931869 -0.371456 0.142827
C  2.022526 0.33287 0.452373
C  2.702488 -0.530384 -0.438286
C  -0.109528 -0.546007 -0.27069
C  0.637545 0.355968 0.564677
C  2.010017 -1.419776 -1.265955
C  0.599508 -1.411402 -1.164657
C  4.295109 0.701395 0.698489
C  -1.56539 -0.658318 -0.285347
C  -2.518409 0.023415 0.432487
C  -2.352881 1.107657 1.464029
H  0.155795 1.036983 1.264542
H  2.534429 -2.086214 -1.954253
H  0.022391 -2.095377 -1.796274
H  4.848065 0.254939 1.542366
H  4.81336 1.563135 0.246642
H  -1.971455 -1.405711 -0.980238
H  -3.340372 1.431883 1.824018
H  -1.833915 1.986216 1.038929
H  -1.770753 0.747036 2.331974
