program: Gaussian 09
title: 000226316
version: EM64L-G09RevD.01
frameworkgroup: C1[X(C10H9ClO4)]
method: RPBEPBE
basis: SDD
operation: Freq
keyword: #p
keyword: freq=noraman
keyword: PBEPBE/SDD
title: #p freq=noraman PBEPBE/SDD
converged: YES YES NO NO
title: Mulliken charges:
elementType: Cl O O O O C C C C C C C C C C H H H H H H H H H
charge: -0.058699 -0.285449 -0.418147 -0.431839 -0.256922 0.588786 0.266795 -0.531407 0.281046 -0.455023 -0.265966 -0.275626 -0.309890 -0.515176 0.153769 0.261703 0.265672 0.268892 0.251960 0.236464 0.216690 0.266070 0.368396 0.377900
chargesum: 0.00000
title: Mulliken charges with hydrogens summed into heavy atoms:
elementType: Cl O O O O C C C C C C C C C C
charge: -0.058699 -0.285449 -0.049751 -0.053940 -0.256922 0.588786 0.266795 -0.269704 0.281046 -0.189351 -0.265966 -0.006734 -0.057930 0.204048 0.153769
polarizability: 2.63415330e+02 4.81456193e+00 1.53239354e+02 6.95619495e-01 -2.44661409e+00 5.72258089e+01
1716.lowfreq: -4.3156 -0.0033 -0.0032 -0.0024 1.1361 4.1270 38.6561 47.8531 68.4673
frequency: 38.6554 47.8309 68.4645 71.1992 96.1593 148.2811 155.9829 180.7323 200.3868 223.1161 237.4218 259.2627 310.4579 334.0958 373.7019 387.7270 440.8304 462.4070 505.9114 519.6328 527.2420 569.9641 607.9229 622.6242 637.2768 698.4733 727.9186 783.3157 792.9729 852.0961 889.7583 897.4250 905.0095 939.8518 1011.5343 1018.0838 1052.6657 1103.5521 1113.1318 1156.3767 1179.7048 1218.1021 1229.0627 1257.1594 1279.9388 1317.4139 1349.4923 1401.6680 1413.3383 1444.6983 1457.5603 1475.2966 1478.3880 1560.5097 1604.0241 1629.8843 1650.6045 2987.0243 3099.8248 3104.1189 3139.4655 3164.0689 3168.0416 3173.0032 3470.9398 3525.8217
redmass: 7.4437 2.4987 5.8548 5.2997 3.9871 1.9509 2.9438 5.9339 8.7657 4.0952 3.7877 6.1129 6.3039 4.5969 6.4965 4.7424 5.8446 1.1240 5.4596 6.1030 4.3448 1.6616 3.3258 2.8960 4.5788 5.1415 3.6593 6.1299 7.4466 1.5390 1.6048 1.9075 5.9788 5.1576 1.1940 3.3638 2.1267 2.5631 1.2393 1.3755 1.8290 1.4682 1.5934 2.1820 1.7651 1.5423 3.1698 4.1311 2.3122 1.5160 1.1043 2.3523 1.2945 6.2942 7.0347 8.3051 5.7115 1.0345 1.0975 1.0901 1.1054 1.0926 1.0925 1.0917 1.0646 1.0640
irintensity: 1.4278 3.9806 0.4035 1.7267 0.6190 1.6887 2.9699 1.3079 1.9444 1.2643 1.0109 1.5057 5.6736 8.8146 3.3836 8.7634 7.9838 129.5935 2.1256 98.9449 16.3287 48.9917 44.3009 54.5245 12.1379 24.9168 2.2902 4.5777 66.8765 31.5926 13.6140 4.9896 35.9172 12.3163 50.9207 77.8433 608.7951 6.5442 5.5020 12.0912 112.3711 85.0019 26.8174 400.3301 36.7787 0.8412 33.2265 8.7931 27.9617 64.4575 25.6056 182.1511 40.9092 96.0230 131.2856 395.2697 128.1826 76.3070 34.0492 1.6017 10.6511 5.2455 0.8074 3.0852 115.8985 57.5850
temp: 298.150 k
press: 1.00000 atm
elementType: 17 8 8 8 8 6 6 6 6 6 6 6 6 6 6 1 1 1 1 1 1 1 1 1
symmnumber: 1
zpe: 447096.0 jmol-1
zpe.correction: 0.170290 hartree
zpe.thermalcorrener: 0.185275 hartree
zpe.thermalcorrenthalpy: 0.186219 hartree
zpe.thermalcorrgfe: 0.126719 hartree
zpe.sumelectzpe: -1146.299773 hartree
zpe.sumelectthermal: -1146.284788 hartree
zpe.sumelectthermalent: -1146.283843 hartree
zpe.sumelectthermalfe: -1146.343343 hartree
dipole: -3.0648 1.1356 1.0349
dipole: 3.4284
quadrupole: -85.7606 -93.4066 -96.6084
quadrupole: 4.6702 -3.0697 3.8575
quadrupole: 6.1646 -1.4814 -4.6832 4.6702 -3.0697 3.8575
hfenergy: -1146.4700625 hartree
pointgroup: C01 [X(C10H9Cl1O4)]
dipole: 1.1966837 0.4248961 -0.4547269 debye
dipolederiv: -0.4372605 0.3043004 0.0166316 0.3380704 -0.5506253 -0.0280225 0.0234495 -0.0302564 -0.0540593 -0.7754146 -0.5896225 0.0739135 -0.7785609 -1.2415364 0.1547123 -0.0332139 -0.0793993 -0.3372599 -1.733324 -0.0283011 -0.0155014 -0.0846006 -0.189723 0.0124124 -0.0513333 0.0223729 -0.3644303 -1.1332798 0.5828269 0.0622184 0.7686059 -0.8227329 -0.0492133 0.0689637 -0.0410914 -0.4418977 -1.0815637 -0.1996736 0.0076843 -0.497361 -0.8784078 -0.0246438 -0.0178953 -0.0338852 -0.3387964 -0.5528584 0.0387921 0.0133202 -0.208845 0.0770509 0.0030397 0.0023117 0.0083518 0.0247615 0.0393275 0.2723866 0.0627009 1.0630273 1.2254796 -0.0720448 0.1700764 0.1575936 0.0371114 -0.0055693 -0.2139532 0.002974 0.1141462 -0.122096 0.0336028 0.024714 0.0635575 -0.1488481 1.3608307 0.2822385 0.0365153 0.0344164 -0.3272379 0.000769 0.0377672 -0.0669204 0.0419107 0.0483773 0.0167827 -0.0011909 -0.0061844 -0.2159541 0.0105358 -0.0084189 0.0103181 -0.1289123 0.2656551 -0.4507506 -0.0299298 -0.8978968 0.7443963 0.0517799 -0.0683299 0.0395791 -0.055516 1.2341882 -0.0162813 -0.0364766 -0.223959 0.1030441 0.0219436 -0.0397911 0.0079016 -0.078743 -1.5856909 0.0827254 0.0458293 0.3411482 0.0187967 0.0055102 0.0533799 0.0123384 -0.188018 0.6040054 0.4586652 -0.1218763 0.206357 0.4089907 -0.099882 -0.1938019 -0.2134403 0.3989443 2.7041534 -0.2741414 -0.088616 0.1346508 1.3110461 0.0724917 -0.0493632 0.0832871 0.2453013 0.0677885 0.0796643 0.0025006 0.0530659 0.0190884 -0.0084076 0.005088 -0.0066405 0.1545573 0.08567 -0.0560743 -0.0019069 -0.0444218 0.0128333 -0.0095899 0.005197 -0.0174419 0.1693267 0.0805913 -0.0085106 0.0016494 -0.048918 -0.0271995 -0.0108759 -0.0033359 -0.0121755 0.1517623 0.0740385 -0.0542022 -0.0019688 -0.0871143 -0.0326184 -0.0117232 -0.0017138 -0.0125232 0.1728459 0.0839325 -0.0235167 0.0260528 -0.0894415 -0.1555944 -0.0226753 0.0223641 -0.0351169 0.0894499 -0.00903 -0.0828136 -0.0536208 -0.0156146 0.0740202 -0.0501931 0.0543928 0.0936723 -0.1792937 -0.0787877 -0.0134896 0.000681 0.1279279 0.1183669 0.0229006 0.0016917 0.0607713 0.0614264 0.4802764 0.0040853 0.0034027 -0.008286 0.2086209 0.0032881 0.0072795 -0.0026422 0.3699641 0.263944 -0.1111366 -0.0049864 -0.1902123 0.2419915 -0.0057146 -0.009478 -0.0082105 0.398413 unknown
polarizability: 262.9681658|-6.6205729|153.4498555|-7.1873077|2.4494696|57.4624716 unknown
InChI: InChI=1S/C10H9ClO4/c1-15-8-5-6(2-3-9(12)13)4-7(11)10(8)14/h2-5,12,14H,1H3
charge 0 multiplicity 1
24 atoms
Cl 2.93453 -2.773822 -0.228189
O  1.959139 2.395725 0.172284
O  3.76628 0.135673 -0.000347
O  -5.153274 1.001098 0.179136
O  -4.766066 -1.28995 0.008037
C  -0.455562 -0.415855 -0.028563
C  1.516508 1.079641 0.021646
C  0.123158 0.882011 0.035204
C  2.387419 -0.055506 -0.049403
C  0.409416 -1.543349 -0.123898
C  1.791934 -1.337324 -0.134327
C  -1.901343 -0.651445 -0.012186
C  -2.892258 0.289492 0.075537
C  3.09054 2.880026 -0.65164
C  -4.306036 -0.121046 0.079943
H  -0.500067 1.778044 0.101211
H  -0.00085 -2.555358 -0.186002
H  -2.22915 -1.699347 -0.077154
H  -2.697765 1.363522 0.14648
H  3.158972 3.952562 -0.41712
H  2.868719 2.742225 -1.726725
H  4.024525 2.360614 -0.389054
H  4.229151 -0.745664 -0.031012
H  -6.097619 0.687234 0.180841
