program: Gaussian 09
title: 000226315
version: EM64L-G09RevD.01
frameworkgroup: C1[X(C9H10O5)]
method: RPBEPBE
basis: SDD
operation: Freq
keyword: #pfreq=noraman
keyword: PBEPBE/SDD
title: #p freq=noraman PBEPBE/SDD
converged: YES YES NO NO
title: Mulliken charges:
elementType: O O O O O C C C C C C C C C H H H H H H H H H H
charge: -0.282452 -0.430966 -0.477512 -0.450414 -0.261517 0.257119 -0.460210 -0.339649 -0.223958 0.195414 0.192722 0.150791 -0.321847 -0.317041 0.293059 0.276596 0.221703 0.247053 0.225208 0.190509 0.206469 0.384640 0.376784 0.347499
chargesum: 0.00000
title: Mulliken charges with hydrogens summed into heavy atoms:
elementType: O O O O O C C C C C C C C C
charge: -0.282452 -0.046326 -0.100728 -0.102915 -0.261517 0.257119 -0.167151 -0.063053 0.244798 0.195414 0.192722 0.150791 -0.096639 0.079937
polarizability: 1.78248987e+02 -7.32922731e+00 1.25123159e+02 -1.61495991e+00 -1.59272906e+00 5.77031637e+01
1716.lowfreq: -4.2489 0.0007 0.0009 0.0010 6.3507 7.5536 20.9338 53.4685 61.0880
frequency: 20.1989 53.4578 61.0796 83.7642 123.5410 160.5000 205.1441 217.4579 243.5211 269.4919 284.2889 306.2527 325.7872 333.4965 387.3047 441.5278 450.5892 472.6806 523.8980 562.5657 567.3762 618.0604 701.7036 738.9032 754.7548 765.2956 806.2524 825.5395 863.1934 918.8728 921.6421 945.1651 1006.9676 1044.6951 1062.5675 1071.1337 1082.3479 1143.2225 1168.8712 1188.0027 1194.7556 1218.0543 1251.6974 1266.5032 1271.7808 1305.2522 1362.7872 1414.4467 1419.7707 1452.2073 1462.7444 1467.7900 1498.7890 1598.7809 1622.1889 1627.4017 2944.6459 3002.0437 3020.8762 3085.2024 3126.7116 3177.9943 3188.0798 3530.8310 3576.2110 3619.4468
redmass: 4.7563 5.6658 7.2624 4.6196 4.6813 5.5478 1.5444 2.9809 2.9858 4.7815 4.5430 1.1410 4.6205 4.6381 5.6272 3.0218 2.8002 1.1225 5.1998 5.2940 5.0738 7.6977 5.1587 3.8907 6.3645 5.2904 1.4804 3.7423 2.8846 1.4740 4.1906 1.3429 2.5219 2.3532 2.0777 2.5781 2.3568 1.2101 1.5162 1.8063 1.3036 1.1046 2.3558 1.1313 2.5767 1.6129 1.3828 7.2047 1.5650 1.0940 1.0804 3.1763 3.5021 8.1206 10.2130 6.7428 1.0580 1.0957 1.0652 1.1067 1.0906 1.0925 1.0945 1.0649 1.0665 1.0666
irintensity: 1.3537 3.5880 2.1544 4.1840 4.7824 0.8445 98.9149 40.0115 33.5169 7.2472 4.9295 174.7359 17.2709 0.3082 24.6328 12.8311 15.8781 132.9902 8.9299 13.6153 5.0293 15.7655 17.1916 21.6661 32.8593 11.8055 32.6151 15.6048 33.0460 23.5900 120.3076 0.8374 32.1132 27.0160 30.6430 21.7574 449.4870 5.1229 24.0444 68.2317 11.5545 24.8703 464.0525 26.3929 280.4982 24.1123 10.8994 3.8908 1.0706 13.8133 10.6157 7.6375 106.4631 108.7125 150.3915 47.2478 70.7425 25.8133 54.2011 19.6954 15.0168 2.8490 1.7537 84.0424 5.0405 76.1672
temp: 298.150 k
press: 1.00000 atm
elementType: 8 8 8 8 8 6 6 6 6 6 6 6 6 6 1 1 1 1 1 1 1 1 1 1
symmnumber: 1
zpe: 469104.3 jmol-1
zpe.correction: 0.178672 hartree
zpe.thermalcorrener: 0.192699 hartree
zpe.thermalcorrenthalpy: 0.193644 hartree
zpe.thermalcorrgfe: 0.136518 hartree
zpe.sumelectzpe: -724.014508 hartree
zpe.sumelectthermal: -724.000481 hartree
zpe.sumelectthermalent: -723.999537 hartree
zpe.sumelectthermalfe: -724.056663 hartree
dipole: -0.4741 -5.3988 1.9372
dipole: 5.7554
quadrupole: -54.4891 -77.2302 -84.2763
quadrupole: -7.9265 -7.8053 -1.5819
quadrupole: 17.5094 -5.2317 -12.2778 -7.9265 -7.8053 -1.5819
hfenergy: -724.1931802 hartree
pointgroup: C01 [X(C9H10O5)]
dipole: -0.1679756 2.1397558 -0.7214727 debye
dipolederiv: -1.8306319 0.2112119 -0.0742538 0.5075055 -0.5532555 0.0399551 -0.1367032 0.0414818 -0.2782259 -1.1532335 0.5296986 -0.0051411 0.6330375 -0.4211152 -0.0008635 -0.0045286 -0.0017122 -0.4158233 -1.4211094 -0.5689319 0.0082456 -0.564228 -0.3718807 0.0028909 0.010774 0.0044383 -0.4318467 -0.5270803 -0.0763035 0.1926211 -0.0270641 -0.5812562 -0.2396464 0.2513588 -0.2812805 -0.4800978 -0.7965798 -0.2075699 0.0072708 -0.0967079 -1.025116 0.05551 -0.0243045 0.0447973 -0.3310071 -0.6968462 -0.3476542 0.0008421 -0.2155905 -0.1033523 0.0097825 0.017515 0.0044783 -0.0313949 0.0260808 0.3190735 -0.0061971 -0.1732796 0.0146396 -0.0024194 0.0092439 -0.0039701 -0.130124 0.0417852 0.0688058 -0.0033434 0.1671034 0.0043122 -0.0002173 -0.0186148 0.0001706 -0.1326397 0.9964326 0.0172786 0.019885 0.1735557 0.152936 0.0066875 0.0258584 0.0336598 0.3064752 0.8949434 -0.613192 0.0058582 -0.9954498 0.146372 0.0022607 0.0078028 0.0008569 0.0676451 2.2847245 0.2067969 0.0303864 -0.221952 1.3332938 -0.1005914 0.0672411 -0.0731914 0.2415805 1.1033416 0.5025391 -0.0088759 0.7876646 0.2487245 -0.0056523 -0.0114373 -0.0045978 0.0291457 -0.3250244 -0.1095307 0.0020265 0.0938881 0.0871105 -0.0026006 0.0008463 -0.0010652 -0.1659773 0.3566287 0.004883 -0.1043984 -0.0415716 0.5322867 0.2459455 -0.1415605 0.2324241 0.4232646 0.1463018 -0.0159841 0.0004509 0.0208407 0.0329773 0.001261 -0.002331 0.0024359 0.1696607 0.0608164 0.0663972 0.0012289 0.0815362 0.0672995 0.0007257 0.00365 0.001974 0.1608475 -0.0364571 0.024087 0.0066055 -0.088483 -0.0106933 -0.0900129 -0.0268469 -0.0934181 0.0109922 -0.0789731 0.006684 -0.0005626 -0.0781285 0.0777471 0.0398533 0.0447 0.0673583 -0.0702966 0.0486747 -0.0615134 0.0011356 -0.0632517 -0.1066076 0.002839 0.0019433 0.0025832 0.1707155 -0.2162627 -0.096843 -0.071472 -0.0593337 -0.0501424 -0.0890067 -0.0116109 -0.0750229 0.0175968 0.0762426 -0.0376648 0.099888 0.0041453 -0.0276426 0.0625045 0.0813734 0.0075981 -0.1681617 0.395817 -0.1232996 0.0012754 -0.1299268 0.2261367 0.0021798 0.0006167 0.0021753 0.3944868 0.3859797 0.1446695 -0.0006809 0.1248846 0.1559832 0.0008438 -0.002367 0.000088 0.4085845 0.2644292 0.156362 -0.1027946 0.1608056 0.1712426 0.0577711 -0.1426188 0.0877382 0.2346 unknown
polarizability: 178.4347413|6.66938|124.9948819|0.6505452|-0.4335801|57.6456863 unknown
InChI: InChI=1S/C9H10O5/c10-3-4-14-9(13)6-1-2-7(11)8(12)5-6/h1-2,5,10-12H,3-4H2
charge 0 multiplicity 1
24 atoms
O  -2.147426 0.000797 -0.090794
O  3.792919 -1.350468 -0.013562
O  4.129128 1.32454 -0.047474
O  -4.603283 1.488855 0.648437
O  -1.308376 -2.168913 0.087898
C  0.229987 -0.274571 -0.016715
C  1.377354 -1.111255 -0.007453
C  0.369835 1.136988 -0.034134
C  -3.520463 -0.560003 -0.02384
C  2.656951 -0.53783 -0.02011
C  -1.104979 -0.931227 0.002705
C  2.790769 0.879246 -0.03851
C  1.656939 1.714672 -0.044139
C  -4.490905 0.52461 -0.453807
H  1.261668 -2.198431 0.011356
H  -0.524786 1.763649 -0.031241
H  -3.582028 -1.441529 -0.687511
H  -3.726464 -0.880626 1.012895
H  1.773548 2.805482 -0.053602
H  -5.473483 0.047144 -0.662023
H  -4.120815 1.002797 -1.384435
H  4.602693 -0.775012 -0.020445
H  4.195162 2.309246 -0.05218
H  -5.150445 2.261639 0.360384
