program: Gaussian 09
title: 000226313
version: EM64L-G09RevD.01
frameworkgroup: C1[X(C13H19NO6)]
method: RPBEPBE
basis: SDD
operation: Freq
keyword: #p
keyword: freq=noraman
keyword: PBEPBE/SDD
title: #p freq=noraman PBEPBE/SDD
converged: YES YES NO NO
title: Mulliken charges:
elementType: O O O O O O N C C C C C C C C C C C C C H H H H H H H H H H H H H H H H H H H
charge: -0.467240 -0.453249 -0.487061 -0.515621 -0.443273 -0.296346 -0.340111 -0.237684 -0.115911 -0.107988 -0.224544 -0.311036 0.231265 -0.497779 0.462205 -0.406389 -0.434787 -0.227237 -0.218609 -0.241536 0.273991 0.224799 0.258288 0.254275 0.196536 0.197146 0.378600 0.369035 0.313312 0.234202 0.273163 0.372422 0.397418 0.365849 0.298787 0.232186 0.232356 0.229005 0.231561
chargesum: 0.00000
title: Mulliken charges with hydrogens summed into heavy atoms:
elementType: O O O O O O N C C C C C C C C C C C C C
charge: -0.088639 -0.084215 -0.114639 -0.118203 -0.077424 -0.296346 -0.026799 0.036308 0.108889 0.150300 0.029730 0.082646 0.231265 0.009586 0.462205 -0.107603 -0.202601 0.005119 0.010396 -0.009974
polarizability: 2.08734726e+02 -1.85752657e+01 1.46023555e+02 -1.34367085e+01 -9.95561170e+00 1.41880618e+02
1716.lowfreq: -10.7263 -3.9897 -0.0004 -0.0001 0.0006 5.0734 19.0968 33.3409 36.1988
frequency: 18.8209 33.1694 36.1411 49.9882 54.9604 79.1404 86.1656 115.2724 127.2225 135.3386 183.3357 202.6492 211.5468 243.6233 263.4080 276.3959 287.5372 317.2242 336.8799 391.4138 407.2071 410.4787 437.9563 460.2419 473.2321 499.2681 511.5753 520.0249 528.4363 564.2798 577.9112 598.9072 615.1299 620.0230 668.6738 709.9581 741.9780 758.7512 772.4204 805.3359 812.8504 853.1125 855.4035 865.4018 886.3118 907.9639 931.7583 975.6623 987.2158 989.6230 992.7404 1004.3473 1013.3078 1024.9205 1028.1680 1037.9745 1052.4991 1062.2350 1082.5276 1094.4128 1099.8932 1165.7251 1174.3410 1191.8696 1196.2241 1210.2505 1228.7579 1232.4711 1236.9630 1247.6692 1256.2816 1270.4932 1297.3163 1314.9155 1318.7967 1331.4118 1348.9506 1355.2521 1363.8535 1369.6872 1378.5887 1386.4062 1393.9042 1442.0507 1447.9842 1460.3051 1473.0137 1488.2018 1513.8006 1594.0412 1614.9605 1627.2656 2950.0047 2971.2119 2982.0484 2994.7879 3018.1555 3044.0850 3050.9704 3057.8804 3115.8304 3119.3059 3133.2093 3146.3065 3163.9707 3173.5577 3236.3356 3462.0768 3507.9103 3527.9830 3538.4680
redmass: 6.0451 4.9612 5.1775 6.2834 4.4095 3.5794 7.6028 4.3487 5.2783 5.7786 4.8456 5.4614 3.6559 5.0683 5.2390 4.7264 4.4617 4.7658 5.1412 4.4288 2.8813 3.5020 4.1835 3.3940 1.1446 1.1571 1.2154 4.0808 4.4654 2.7828 2.3987 3.1591 6.3053 1.6639 1.2556 2.1476 2.5391 2.0283 3.8078 3.4920 3.5957 1.9344 1.4602 1.2506 3.8470 2.5227 1.5629 4.5454 2.6231 1.9185 4.3698 1.7488 2.1704 2.2088 2.1774 3.1782 2.9485 3.1518 3.0154 1.7553 3.4554 1.1698 1.0542 1.1624 1.1435 2.2580 1.2251 1.2863 1.2136 1.7273 1.4384 1.1603 1.3353 1.2863 1.4292 1.3738 1.2211 1.3909 1.2666 1.3123 1.4564 4.5404 1.3545 2.0892 1.1787 1.0913 1.1479 2.0168 1.9454 5.8934 5.8024 6.7296 1.0684 1.0821 1.0832 1.0607 1.0853 1.0859 1.1011 1.0965 1.0875 1.0896 1.0904 1.0955 1.1014 1.0662 1.0636 1.0649 1.0651 1.0651 1.0773
irintensity: 0.0473 2.8654 0.0653 3.4557 1.7068 1.3801 3.6091 3.6810 1.8546 0.7344 1.3426 12.9203 2.3479 10.2169 9.5270 22.9821 12.3703 3.8440 3.2105 65.7660 0.2036 0.4605 6.9026 7.2447 25.4664 292.0733 94.5521 13.0036 12.0404 19.3376 32.0046 11.9199 1.6689 109.7852 34.3355 34.1874 13.4875 75.7761 13.8960 35.6667 15.9955 8.6726 329.9101 0.1898 19.3158 10.6448 11.1280 41.9015 4.4358 1.6017 100.7814 15.3170 16.8997 7.9573 14.1645 94.9182 19.7289 24.4691 76.1882 2.8156 14.5942 2.5914 0.2675 63.6157 2.3823 1.6404 32.1099 11.9786 6.6448 106.3994 24.5670 95.9369 6.7078 15.8193 15.7909 3.6684 4.7355 4.0069 124.6236 61.9530 125.3241 1.1118 18.3469 31.8042 157.6422 1.4436 29.9215 7.3518 140.0105 1.7579 7.4658 169.5047 44.5885 34.5856 22.0940 30.8039 31.6253 39.7630 6.8205 56.5332 8.4319 4.3810 5.4597 25.8063 30.2857 345.1915 107.1448 35.5648 33.1437 20.8794 21.2555
temp: 298.150 k
press: 1.00000 atm
elementType: 8 8 8 8 8 8 7 6 6 6 6 6 6 6 6 6 6 6 6 6 1 1 1 1 1 1 1 1 1 1 1 1 1 1 1 1 1 1 1
symmnumber: 1
zpe: 824323.9 jmol-1
zpe.correction: 0.313968 hartree
zpe.thermalcorrener: 0.334152 hartree
zpe.thermalcorrenthalpy: 0.335096 hartree
zpe.thermalcorrgfe: 0.263136 hartree
zpe.sumelectzpe: -1011.320749 hartree
zpe.sumelectthermal: -1011.300566 hartree
zpe.sumelectthermalent: -1011.299622 hartree
zpe.sumelectthermalfe: -1011.371581 hartree
dipole: 3.6813 -0.8679 -0.7496
dipole: 3.8558
quadrupole: -125.5777 -125.3083 -121.8307
quadrupole: -9.4238 -12.8529 -5.2287
quadrupole: -1.3388 -1.0694 2.4082 -9.4238 -12.8529 -5.2287
hfenergy: -1011.6347177 hartree
pointgroup: C01 [X(C13H19N1O6)]
dipole: 1.4309329 0.5033749 0.0181274 debye
polarizability: 207.0539832|25.4915538|136.0135118|-1.3124319|-2.6727199|153.5714047 unknown
InChI: InChI=1S/C13H19NO6/c15-7-9(16)10(17)11(18)12(19)13(20)14-6-8-4-2-1-3-5-8/h1-5,9-12,14-19H,6-7H2
charge 0 multiplicity 1
39 atoms
O  -3.146091 -1.660181 -1.189412
O  -0.473296 -0.861152 -1.256308
O  -5.234869 0.164068 -0.940304
O  -2.074297 -1.838655 1.212426
O  -5.093059 2.563787 0.374358
O  0.373042 -2.007862 1.981006
N  0.996382 0.181019 1.459744
C  -2.828126 -0.21957 -1.029911
C  -1.406123 -0.097367 -0.422209
C  -3.968707 0.465624 -0.250281
C  -1.350561 -0.571428 1.057562
C  -3.89212 2.000283 -0.235751
C  0.09999 -0.842961 1.536849
C  2.435945 0.006586 1.740833
C  3.305877 0.418354 0.556301
C  2.915252 0.114157 -0.774088
C  4.534417 1.086362 0.783438
C  3.75138 0.472128 -1.855584
C  5.371634 1.437658 -0.299579
C  4.981376 1.131263 -1.623532
H  -2.805909 0.176792 -2.06139
H  -1.068875 0.954802 -0.480895
H  -4.021176 0.075789 0.788178
H  -1.822682 0.190318 1.710766
H  -3.049218 2.356041 0.382221
H  -3.762963 2.36595 -1.277869
H  -2.95882 -2.065003 -0.278684
H  -0.977191 -1.655748 -1.587446
H  0.706664 1.066879 1.039406
H  2.716797 0.586169 2.640874
H  2.568601 -1.06408 1.983428
H  -5.200199 -0.795651 -1.200338
H  -1.401611 -2.46998 1.626793
H  -5.865155 2.094522 -0.039789
H  1.961139 -0.393329 -0.965611
H  4.839076 1.331814 1.808856
H  3.442195 0.234338 -2.879577
H  6.320192 1.952988 -0.111721
H  5.626892 1.406078 -2.465156
