program: Gaussian 09
title: 000241948
version: EM64L-G09RevD.01
frameworkgroup: C1[X(C17H24O3)]
method: RPBEPBE
basis: SDD
operation: Freq
keyword: #pfreq=noraman
keyword: PBEPBE/SDD
title: #p freq=noraman PBEPBE/SDD
converged: YES YES NO NO
title: Mulliken charges:
elementType: O O O C C C C C C C C C C C C C C C C C H H H H H H H H H H H H H H H H H H H H H H H H
charge: -0.222716 -0.417819 -0.231520 -0.383359 -0.384178 -0.371076 -0.369321 -0.388569 -0.375849 -0.533861 -0.488294 0.107255 0.290888 0.170670 -0.337206 -0.354145 0.442020 -0.434952 -0.356554 -0.806705 0.195758 0.195631 0.195030 0.195124 0.188134 0.187982 0.192222 0.192153 0.218029 0.217255 0.217420 0.217532 0.233978 0.234304 0.252557 0.252602 0.244898 0.275950 0.232870 0.233596 0.235420 0.235046 0.226872 0.374927
chargesum: 0.00000
title: Mulliken charges with hydrogens summed into heavy atoms:
elementType: O O O C C C C C C C C C C C C C C C C C
charge: -0.222716 -0.042892 -0.231520 0.008030 0.005976 0.005040 0.015054 0.046715 0.059104 -0.065580 0.016864 0.107255 0.290888 0.170670 -0.092308 -0.078194 0.442020 -0.202082 -0.122958 -0.109368
polarizability: 2.86834860e+02 1.59352273e+01 1.87373850e+02 -8.03848044e-02 7.53525341e-02 1.15744082e+02
1716.lowfreq: -0.0011 0.0011 0.0014 1.5053 3.4680 7.7372 12.8052 17.1922 21.6631
frequency: 12.5782 16.6998 21.6622 26.7917 35.7809 51.1586 62.9691 63.8089 82.5257 98.3211 107.8472 113.5730 127.6718 145.1466 149.9128 156.4348 195.1842 261.8130 264.4415 289.0168 338.2862 346.8030 402.9779 403.8855 446.0021 460.0264 476.7152 499.5851 513.4269 567.5524 587.4878 590.8648 633.7396 636.4509 718.8388 723.9918 727.7582 745.6889 749.4099 789.2617 807.2984 823.9694 856.4224 856.8247 863.3634 923.1089 962.5172 967.7063 986.6716 997.0785 999.5884 1003.1278 1007.6089 1014.1154 1035.9183 1047.2650 1063.7752 1071.4422 1081.7663 1086.1920 1095.3620 1107.2285 1116.7480 1122.3718 1189.6964 1198.9400 1199.5972 1220.1358 1225.9276 1234.6834 1241.7990 1266.4619 1268.7928 1282.5190 1287.9625 1295.3103 1298.5747 1299.7801 1308.5016 1325.9849 1348.9126 1360.3506 1361.4469 1373.0079 1373.5841 1396.0278 1411.0628 1434.9392 1437.0460 1461.3778 1463.5370 1465.4625 1468.0627 1472.1242 1472.4847 1481.3110 1488.2642 1501.9423 1563.3436 1594.0918 1621.7817 1669.3017 2948.5617 2952.3868 2954.9069 2957.8621 2964.4323 2978.4108 2985.6901 2986.1032 2992.0381 2995.2387 2995.7292 3002.4383 3009.5869 3028.3532 3035.6377 3056.8619 3058.4990 3062.1174 3087.9906 3123.2579 3126.0736 3153.1294 3158.0636 3511.8155
redmass: 9.1766 4.3230 5.3071 1.1107 3.6268 1.9019 3.5566 5.0690 2.2556 2.7141 2.6105 6.3251 1.9775 5.2521 2.1237 1.9925 4.8068 4.7345 3.8429 4.9501 3.2285 4.6826 4.3256 2.8333 3.8284 2.7681 3.9576 1.7715 3.4564 2.1670 4.9042 5.1389 6.9399 1.3217 1.5191 1.1489 1.4642 1.2432 5.0442 1.3200 5.4540 1.3505 1.3784 4.6766 1.3300 1.3995 4.3157 1.3500 1.6941 1.2896 3.4269 1.3307 4.2178 2.9516 2.9190 1.5834 2.7637 2.7992 2.0865 2.2077 1.4375 3.9338 1.3945 1.3246 1.2241 1.5889 1.3826 1.8810 2.1972 1.3576 1.5451 1.5890 1.2204 1.0337 1.0864 1.5939 1.1099 1.1109 1.3117 1.5980 1.6352 1.7071 1.6730 1.8440 4.1452 1.2631 3.5497 1.1031 1.0843 1.0726 1.0743 1.0715 1.0459 1.1001 1.1079 1.0988 1.1007 2.6030 6.1953 7.7483 6.4710 8.2292 1.0589 1.0590 1.0594 1.0598 1.0590 1.0373 1.0970 1.0612 1.0995 1.0603 1.0596 1.0972 1.1032 1.1003 1.1035 1.0972 1.1033 1.1032 1.0990 1.0891 1.0884 1.0945 1.0958 1.0639
irintensity: 2.6302 0.0107 0.6796 0.9505 0.1207 0.0110 1.0299 0.1691 1.8445 0.0195 0.3110 0.2471 0.3643 0.8361 0.1493 0.5693 6.3625 0.1140 1.0086 8.9100 0.2731 7.8526 2.3364 0.0073 0.5921 10.8907 6.1923 29.3081 29.4082 8.7692 18.9668 0.3108 0.7080 128.3707 5.6184 17.6228 0.2499 13.9503 4.0244 5.2993 0.1082 42.0696 0.8428 1.3882 5.8231 0.3797 23.7427 0.6508 0.4398 1.7795 167.8833 0.7523 1.1254 2.2805 111.5619 13.8889 1.2247 47.6297 4.7671 5.4532 0.3508 19.5589 0.2898 14.3872 53.8087 0.2646 8.0427 80.4619 13.5663 0.0171 43.0329 17.7965 0.1394 0.0063 0.3224 113.3395 0.0117 0.0459 5.9555 5.4619 64.1301 0.2425 1.5345 29.2106 1.4131 15.7813 16.6440 12.2663 27.5036 0.2780 0.0319 0.2060 13.6727 1.3508 21.0122 0.0132 26.8919 0.1247 89.5218 90.0570 37.9101 207.1720 7.9029 1.9514 0.4747 25.5102 107.4493 27.8391 0.6223 5.3961 6.7121 16.5584 53.1847 5.6939 0.4601 13.7952 45.1687 16.4804 51.1648 116.8708 18.3353 14.3852 18.6482 21.1939 2.4924 17.7781
temp: 298.150 k
press: 1.00000 atm
elementType: 8 8 8 6 6 6 6 6 6 6 6 6 6 6 6 6 6 6 6 6 1 1 1 1 1 1 1 1 1 1 1 1 1 1 1 1 1 1 1 1 1 1 1 1
symmnumber: 1
zpe: 975129.2 jmol-1
zpe.correction: 0.371407 hartree
zpe.thermalcorrener: 0.393876 hartree
zpe.thermalcorrenthalpy: 0.394820 hartree
zpe.thermalcorrgfe: 0.313556 hartree
zpe.sumelectzpe: -886.370528 hartree
zpe.sumelectthermal: -886.348060 hartree
zpe.sumelectthermalent: -886.347116 hartree
zpe.sumelectthermalfe: -886.428380 hartree
dipole: 1.9683 1.7811 -0.0170
dipole: 2.6546
quadrupole: -93.9910 -130.6337 -121.3535
quadrupole: 21.8194 0.0883 -0.0737
quadrupole: 21.3350 -15.3076 -6.0274 21.8194 0.0883 -0.0737
hfenergy: -886.7419355 hartree
pointgroup: C01 [X(C17H24O3)]
dipole: 0.7722092 -0.7029273 0.0185699 debye
polarizability: 286.734577|-16.2402124|187.456733|0.4042691|-1.117028|115.7614827 unknown
InChI: InChI=1S/C17H24O3/c1-14-10-12-15(13-11-14)16(18)8-6-4-2-3-5-7-9-17(19)20/h10-13,19H,2-9H2,1H3
charge 0 multiplicity 1
44 atoms
O  2.917448 2.209942 -0.055523
O  -9.651608 0.303906 -0.011806
O  -8.514514 -1.719413 0.000216
C  -2.112364 0.686538 -0.023934
C  -3.354638 -0.231848 -0.018575
C  -0.777162 -0.09149 -0.020608
C  -4.689034 0.54734 -0.019569
C  0.457879 0.835552 -0.0282
C  -5.924796 -0.378745 -0.014521
C  1.782863 0.051425 -0.020505
C  -7.245243 0.41438 -0.015378
C  3.026917 0.947206 -0.03345
C  4.383887 0.301079 -0.019946
C  -8.476266 -0.469822 -0.008135
C  4.567017 -1.10671 0.00607
C  5.536556 1.1347 -0.033192
C  7.015522 -0.832882 0.005757
C  5.864395 -1.661419 0.018807
C  6.826374 0.57712 -0.020583
C  8.41211 -1.425858 0.018673
H  -2.147305 1.347592 -0.914957
H  -2.146355 1.356589 0.860383
H  -3.318345 -0.893805 0.871815
H  -3.320914 -0.900676 -0.903901
H  -0.74475 -0.762894 -0.904806
H  -0.742732 -0.751506 0.872065
H  -4.72364 1.209547 -0.910185
H  -4.721211 1.215822 0.866436
H  0.430408 1.496134 -0.91578
H  0.429474 1.511467 0.847817
H  -5.897446 -1.047636 -0.896094
H  -5.894986 -1.041421 0.871642
H  1.830802 -0.608683 0.871036
H  1.828767 -0.62951 -0.8965
H  -7.306802 1.086724 0.863187
H  -7.310996 1.078348 -0.899959
H  3.701804 -1.777803 0.016751
H  5.384212 2.219137 -0.053003
H  5.988023 -2.750716 0.039148
H  7.703614 1.23577 -0.03092
H  8.981423 -1.126417 -0.88146
H  8.987565 -1.073813 0.895404
H  8.386148 -2.528195 0.051029
H  -10.439997 -0.304658 -0.006645
