program: Gaussian 09
title: 000226305
version: EM64L-G09RevD.01
frameworkgroup: C1[X(C11H21NO3)]
method: RPBEPBE
basis: SDD
operation: Freq
keyword: #p
keyword: freq=noraman
keyword: PBEPBE/SDD
title: #p freq=noraman PBEPBE/SDD
converged: YES YES NO NO
title: Mulliken charges:
elementType: O O O N C C C C C C C C C C C H H H H H H H H H H H H H H H H H H H H H
charge: -0.403862 -0.238205 -0.278289 -0.397856 -0.356394 -0.386964 -0.389466 -0.376001 -0.138363 -0.352830 -0.356821 0.132453 -0.696517 0.254676 -0.772580 0.208595 0.215903 0.192574 0.193060 0.228745 0.203866 0.196109 0.191777 0.295146 0.187748 0.186632 0.195115 0.196662 0.322508 0.209637 0.215687 0.209061 0.252374 0.254271 0.215336 0.386214
chargesum: 0.00000
title: Mulliken charges with hydrogens summed into heavy atoms:
elementType: O O O N C C C C C C C C C C C
charge: -0.017647 -0.238205 -0.278289 -0.075348 0.068104 -0.001330 0.043145 0.011885 0.156783 0.021550 0.034955 0.132453 -0.062132 0.254676 -0.050599
polarizability: 1.57616875e+02 -3.36015776e+00 1.39398273e+02 -8.04407552e+00 -9.44109596e-01 1.14024077e+02
1716.lowfreq: -8.5339 -5.7276 -0.0006 -0.0003 -0.0003 6.5090 24.8883 26.6819 37.1532
frequency: 24.5906 26.5297 37.1281 51.9155 58.6031 67.3232 75.0529 85.2636 98.6449 117.5377 130.3066 136.5702 171.8107 178.0535 225.6571 233.7085 283.6419 338.6781 342.2335 382.3385 446.7018 463.5632 504.9131 566.5806 594.2369 598.8410 609.8308 614.8643 702.5323 719.1713 728.1044 759.0442 819.0496 869.7950 887.8332 892.2352 945.0110 962.1743 989.6435 996.4632 1013.0857 1033.8243 1041.2459 1052.3822 1060.9076 1076.9002 1080.9337 1104.0312 1118.0494 1163.2985 1191.5358 1211.8908 1230.6192 1235.6273 1256.6604 1270.9193 1273.2761 1281.8632 1291.3828 1298.3129 1307.5073 1323.6215 1340.3378 1342.2905 1354.5128 1357.3337 1387.6132 1388.2311 1450.0178 1454.2039 1460.1089 1462.4423 1466.6860 1467.6878 1475.0970 1475.9417 1482.7787 1488.4953 1488.6692 1614.4758 1650.5829 2948.9391 2950.8345 2959.1302 2968.3073 2970.7581 2973.7101 2984.7945 2985.5150 2993.9746 2997.2920 3013.5824 3022.8282 3030.4982 3038.0559 3060.0772 3066.9417 3069.9927 3097.5760 3102.1116 3512.5507 3531.8328
redmass: 3.9111 1.6728 4.0849 5.0608 2.8446 2.9749 1.6369 1.7793 2.5625 4.5656 2.5053 1.8916 3.4081 4.3333 1.1237 3.7731 4.8934 3.6043 4.1668 3.2410 3.2448 2.9719 3.0123 1.9100 3.6514 1.3045 2.2468 2.7970 3.6037 1.0668 1.1053 1.1794 1.2890 5.2474 1.7282 1.6368 1.6795 4.1314 1.8289 1.7538 1.9642 3.1726 1.6466 2.9124 2.2730 2.3432 2.2371 2.3621 2.4896 2.4220 1.6683 1.2576 1.3664 1.3601 1.6470 1.4827 1.2589 1.0391 1.1151 1.1237 1.3547 1.2584 2.2882 1.4458 1.6605 1.5797 1.2292 1.2175 1.0499 1.1069 1.0777 1.0771 1.0956 1.0830 1.0802 1.0433 1.0880 1.8199 1.0977 6.5574 8.3278 1.0588 1.0586 1.0592 1.0580 1.0374 1.0608 1.0925 1.0635 1.0999 1.0359 1.1024 1.0868 1.0994 1.1017 1.1037 1.1008 1.0992 1.0985 1.1003 1.0641 1.0775
irintensity: 0.1114 0.1411 1.4129 0.9824 1.2741 10.3047 0.6877 0.7514 4.0121 1.2009 1.6849 0.3342 7.7306 1.0877 0.0012 0.5077 1.3243 1.1787 2.3259 6.0680 21.3870 1.1574 34.3059 7.4950 8.0020 214.6403 1.4320 37.1827 41.3973 14.1794 0.5358 6.3232 1.5108 5.6316 1.5975 10.1348 5.5877 9.5515 4.9315 2.1406 0.0865 9.0065 16.7088 23.6792 202.2145 1.6779 1.8739 4.0633 17.3464 3.2167 0.8292 21.6577 0.7038 1.0258 29.2968 11.8003 4.9102 0.6909 0.3409 3.1005 6.7238 16.3490 132.7731 0.1617 0.8728 2.5748 65.5912 10.3611 16.9393 29.2661 2.3743 7.5246 35.6984 4.3976 6.4395 11.4643 9.4529 171.9395 12.8624 217.2717 181.8675 2.5838 5.9797 21.0842 106.1816 32.7221 9.4395 6.2099 55.6456 1.0913 9.8833 0.6850 4.2297 29.6718 42.6507 76.5893 108.6862 54.2436 11.4721 16.8550 30.2936 39.1214
temp: 298.150 k
press: 1.00000 atm
elementType: 8 8 8 7 6 6 6 6 6 6 6 6 6 6 6 1 1 1 1 1 1 1 1 1 1 1 1 1 1 1 1 1 1 1 1 1
symmnumber: 1
zpe: 810714.4 jmol-1
zpe.correction: 0.308785 hartree
zpe.thermalcorrener: 0.327701 hartree
zpe.thermalcorrenthalpy: 0.328645 hartree
zpe.thermalcorrgfe: 0.258009 hartree
zpe.sumelectzpe: -711.005708 hartree
zpe.sumelectthermal: -710.986792 hartree
zpe.sumelectthermalent: -710.985848 hartree
zpe.sumelectthermalfe: -711.056484 hartree
dipole: 0.0635 -1.5790 -2.1393
dipole: 2.6596
quadrupole: -92.8981 -86.4922 -97.4477
quadrupole: -3.0612 -1.5178 -9.0416
quadrupole: -0.6188 5.7871 -5.1683 -3.0612 -1.5178 -9.0416
hfenergy: -711.314493 hartree
pointgroup: C01 [X(C11H21N1O3)]
dipole: -0.0387189 -0.6137485 -0.8465996 debye
polarizability: 156.5989781|-4.3497506|139.8692489|-9.4660046|-0.0858256|114.5709971 unknown
InChI: InChI=1S/C11H21NO3/c1-3-4-5-6-7-8-10(11(14)15)12-9(2)13/h10,12,14H,3-8H2,1-2H3
charge 0 multiplicity 1
36 atoms
O  2.882423 -2.809756 0.632898
O  3.792925 -1.653954 -1.164163
O  1.883998 1.963579 1.286674
N  2.328613 0.603006 -0.547634
C  -0.58797 -0.144066 0.176033
C  -2.001412 -0.66649 -0.165125
C  0.516974 -1.142445 -0.227323
C  -3.120053 0.320515 0.238703
C  1.950459 -0.637073 0.138544
C  -4.538261 -0.187554 -0.104754
C  -5.655844 0.799018 0.304595
C  2.978251 -1.706838 -0.213927
C  -7.070218 0.287751 -0.04466
C  2.307033 1.832559 0.097047
C  2.816031 3.011773 -0.725686
H  -0.417957 0.822913 -0.336309
H  -0.515735 0.067153 1.261085
H  -2.068773 -0.870364 -1.25472
H  -2.170909 -1.638565 0.344105
H  0.356565 -2.109396 0.287144
H  0.470615 -1.337657 -1.318173
H  -3.055391 0.520256 1.328499
H  -2.947506 1.294872 -0.264543
H  1.979092 -0.433565 1.22578
H  -4.711765 -1.163217 0.396319
H  -4.605406 -0.383097 -1.19579
H  -5.479963 1.774501 -0.193456
H  -5.589128 0.991638 1.3949
H  2.783693 0.505101 -1.458988
H  -7.282283 -0.671074 0.465483
H  -7.849734 1.010935 0.258344
H  -7.172275 0.116876 -1.133189
H  2.00583 3.753668 -0.833267
H  3.637119 3.504045 -0.176972
H  3.174271 2.727148 -1.729876
H  3.541391 -3.502996 0.356103
