program: Gaussian 09
title: 000226303
version: EM64L-G09RevD.01
frameworkgroup: C1[X(C19H33N3OS)]
method: RPBEPBE
basis: SDD
operation: Freq
keyword: #p
keyword: freq=noraman
keyword: PBEPBE/SDD
title: #p freq=noraman PBEPBE/SDD
converged: YES YES NO NO
title: Mulliken charges:
elementType: S O N N N C C C C C C C C C C C C C C C C C C C H H H H H H H H H H H H H H H H H H H H H H H H H H H H H H H H H
charge: 0.131318 -0.306431 -0.101803 -0.416032 -0.388610 -0.300152 -0.365045 -0.327387 -0.683300 -0.425262 -0.670116 -0.673011 -0.355905 -0.658505 -0.344077 -0.329847 0.474542 0.280694 -0.679557 -0.432153 -0.382445 0.163256 -0.352284 -0.357685 0.209725 0.213531 0.276734 0.180321 0.205869 0.184666 0.269626 0.263218 0.207023 0.205429 0.210262 0.223190 0.208421 0.224026 0.197077 0.202159 0.226627 0.208950 0.287291 0.244053 0.204937 0.191423 0.253394 0.228804 0.295927 0.301039 0.210365 0.222459 0.210373 0.217655 0.241392 0.267678 0.206150
chargesum: 0.00000
title: Mulliken charges with hydrogens summed into heavy atoms:
elementType: S O N N N C C C C C C C C C C C C C C C C C C C
charge: 0.131318 -0.306431 -0.101803 -0.120105 -0.087571 0.123105 0.092010 0.063148 -0.150455 -0.012810 -0.040592 -0.035274 0.077547 -0.127160 0.052282 0.152351 0.474542 0.280694 -0.036360 -0.214498 -0.141052 0.163256 -0.084606 -0.151535
polarizability: 3.97409269e+02 1.18952224e+01 2.55825983e+02 -9.00326446e+00 -4.31927437e+00 1.65441794e+02
1716.lowfreq: -4.0222 -0.0014 0.0008 0.0013 3.7391 7.6620 15.7868 16.1127 22.2319
frequency: 15.5276 15.9688 21.8062 27.8955 41.8071 43.4498 49.9735 58.3754 63.0025 69.0117 79.1284 89.3930 97.8627 102.9238 134.4572 152.3640 155.4247 178.6591 195.8304 210.6301 219.2165 233.4217 250.1875 257.7342 262.6685 276.6559 277.2574 293.4462 313.8637 320.3323 329.6400 363.4928 393.4616 405.9273 414.6422 430.5676 444.7286 478.2599 481.1521 501.7813 511.1503 523.2519 630.5062 641.9054 667.6725 684.3351 698.4160 730.5618 732.7578 743.5535 755.3527 762.6160 791.6400 800.4165 806.2835 807.4504 822.7498 835.3699 840.7487 869.2833 909.2526 938.1055 959.9695 975.2643 979.8734 982.5376 989.2341 992.9556 1003.4762 1035.7880 1040.4853 1047.0939 1048.2282 1074.0983 1076.4770 1083.9547 1102.7457 1107.3998 1117.7456 1130.0383 1141.7903 1144.2827 1160.5063 1184.3855 1196.0087 1206.3538 1220.8180 1223.7938 1237.4998 1251.5423 1252.8486 1274.0595 1281.0075 1283.5697 1291.3931 1298.0973 1300.6330 1304.6814 1306.2217 1319.7029 1354.3605 1357.0081 1361.8291 1364.6914 1368.3553 1369.8402 1380.8097 1382.5585 1390.2922 1391.9775 1426.7944 1435.7654 1442.5615 1445.3330 1457.7628 1460.4502 1462.4885 1468.4290 1472.9009 1473.4881 1478.8203 1479.1698 1480.5158 1483.0134 1486.9809 1487.4733 1494.2097 1498.0942 1528.5663 1557.3128 1588.8609 1632.7892 2845.8419 2858.3681 2893.3953 2928.8896 2962.0268 2971.4307 2975.3661 2976.2836 2979.1706 2982.8977 3012.1812 3021.9121 3027.2727 3032.2929 3036.7810 3042.0278 3044.7020 3048.2315 3070.4817 3071.7027 3072.1329 3077.6380 3082.4821 3087.7329 3088.8913 3111.8593 3112.9800 3114.9735 3116.4264 3158.3445 3163.3799 3566.7643 3568.9467
redmass: 3.9661 4.3793 3.4044 3.7159 4.4271 3.9641 4.1909 2.6536 2.2636 2.8458 3.1553 2.4768 4.0322 3.5591 2.3182 3.7212 2.7541 2.3261 1.6156 1.8009 1.9789 1.4750 2.0807 1.8968 2.3329 3.0579 2.8644 2.2148 3.9375 3.5385 2.7878 1.2129 2.9271 5.2553 3.0660 4.0520 2.7444 2.6810 2.8290 3.4105 1.7889 2.0293 6.2356 4.2168 4.6734 3.9955 2.4991 1.6813 1.1985 2.1045 4.4122 1.5839 1.1355 2.0205 1.1952 1.4795 2.3206 1.8015 2.0593 1.9115 1.9204 1.3892 1.2517 2.6987 1.3560 2.3412 2.0249 1.8060 2.8040 3.5037 2.5538 2.7351 2.3470 2.9278 1.8754 2.1753 1.7014 2.4320 1.5278 1.8882 1.8913 1.7959 2.0596 1.3335 1.1962 2.1682 1.3995 1.2700 1.3268 1.3036 1.2326 1.3791 1.7960 1.1844 1.1843 1.2425 1.3244 1.1932 1.2525 1.4958 1.3166 1.6836 1.2565 1.5588 1.3310 2.8259 1.2299 1.2329 1.3115 1.2124 1.1152 3.5729 1.1218 1.1744 1.1959 1.0612 1.0551 1.4596 1.0543 1.0678 1.0461 1.0553 1.0674 1.7324 1.0938 1.0699 1.1240 1.0844 3.5812 4.3995 5.6412 6.4143 1.0719 1.0717 1.0702 1.0579 1.0819 1.0625 1.0383 1.0361 1.0355 1.0783 1.0975 1.0595 1.0871 1.0580 1.0593 1.1018 1.0886 1.0896 1.0977 1.1008 1.0975 1.0994 1.1034 1.1000 1.1002 1.1073 1.1072 1.0886 1.0888 1.0941 1.0939 1.0768 1.0776
irintensity: 0.2163 0.6189 0.0777 0.0540 0.2173 0.2008 0.9845 3.2615 3.4764 0.8765 1.0173 1.9990 1.7749 2.9593 1.0043 1.9292 1.7805 2.4672 1.7137 3.8009 1.2321 1.7411 2.5638 1.9064 2.0150 2.5737 2.1943 0.5915 10.1192 12.4162 0.3327 76.7411 5.2838 5.2212 2.6628 3.3272 3.3174 3.5435 29.2946 4.7284 43.7220 55.4785 2.1780 5.0624 21.3539 19.7729 17.7569 11.6594 8.5086 11.6642 21.5086 4.5303 5.5721 0.1667 3.0824 10.9594 6.1106 20.6829 35.1712 1.1922 1.2532 0.1043 6.5034 0.7457 2.4758 6.2506 6.5085 1.9261 0.9582 1.0176 6.7665 0.1546 7.5808 28.7548 9.8931 3.6298 42.9238 1.6616 17.1706 10.0265 24.3214 2.4178 14.2529 14.5260 139.4565 32.2270 7.8638 1.1151 10.6868 9.7155 7.0462 37.8438 194.3847 29.1778 18.6407 69.0111 31.5915 29.3333 16.9053 10.9926 7.7146 19.1010 2.5616 10.4302 1.7283 77.4656 8.7583 22.3380 17.5185 10.6619 9.0679 18.6879 11.6737 31.1397 10.6960 2.3102 6.9098 87.8272 4.7571 1.5005 9.8332 26.9663 23.9847 529.1990 29.5643 11.5783 14.6444 13.4740 132.8745 41.9166 144.9179 423.3113 64.7921 121.5468 97.7078 57.4102 7.3172 31.2900 27.2092 34.9144 38.1978 103.7064 2.5892 22.1101 15.5640 29.1138 12.3742 42.0459 41.6076 1.7524 18.8442 86.9361 81.9113 42.8025 3.5396 35.4563 46.2848 15.7227 19.3676 37.5512 2.7270 9.2494 15.6488 63.2778 9.4666
temp: 298.150 k
press: 1.00000 atm
elementType: 16 8 7 7 7 6 6 6 6 6 6 6 6 6 6 6 6 6 6 6 6 6 6 6 1 1 1 1 1 1 1 1 1 1 1 1 1 1 1 1 1 1 1 1 1 1 1 1 1 1 1 1 1 1 1 1 1
symmnumber: 1
zpe: 1294653.6 jmol-1
zpe.correction: 0.493108 hartree
zpe.thermalcorrener: 0.521923 hartree
zpe.thermalcorrenthalpy: 0.522867 hartree
zpe.thermalcorrgfe: 0.428814 hartree
zpe.sumelectzpe: -1379.469770 hartree
zpe.sumelectthermal: -1379.440955 hartree
zpe.sumelectthermalent: -1379.440011 hartree
zpe.sumelectthermalfe: -1379.534064 hartree
dipole: 8.1544 -0.4778 -1.4332
dipole: 8.2932
quadrupole: -130.2176 -145.4348 -160.4703
quadrupole: -6.4050 -0.0482 -4.8052
quadrupole: 15.1567 -0.0606 -15.0961 -6.4050 -0.0482 -4.8052
hfenergy: -1379.962878 hartree
pointgroup: C01 [X(C19H33N3O1S1)]
dipole: -3.2294217 0.0314414 -0.4643774 debye
polarizability: 396.1785694|19.0624638|257.2781386|1.8752647|5.1682907|165.2203385 unknown
InChI: InChI=1S/C19H33N3OS/c1-4-7-12-20-18-10-8-17(9-11-18)19(23)21-13-15-24-16-14-22(5-2)6-3/h8-11,20-21H,4-7,12-16H2,1-3H3
charge 0 multiplicity 1
57 atoms
S  4.868051 2.92451 -0.442031
O  1.357855 0.192789 0.47024
N  5.457592 -1.23218 -0.30525
N  -5.04395 -0.458398 -0.317401
N  0.793594 2.439621 0.367329
C  5.36536 0.128117 -0.889871
C  4.122813 -1.848041 -0.057027
C  6.401657 -2.131328 -1.015556
C  5.201593 1.176214 0.227792
C  -7.52316 -0.342041 -0.44701
C  4.133494 -2.842348 1.119896
C  7.879456 -1.785931 -0.747314
C  -6.21317 0.409236 -0.134572
C  3.010623 2.752666 -0.761142
C  -7.844949 -1.501661 0.52752
C  2.193505 2.862026 0.546334
C  -3.728629 -0.051256 -0.141492
C  -0.992117 0.750367 0.193291
C  -9.19694 -2.175583 0.209799
C  -2.657022 -0.977228 -0.350282
C  -3.400178 1.281586 0.256139
C  0.454652 1.090785 0.354374
C  -1.325562 -0.58167 -0.179506
C  -2.055932 1.66431 0.416012
H  4.5206 0.213228 -1.615152
H  6.287222 0.351776 -1.455863
H  3.398473 -1.045139 0.168246
H  3.743682 -2.358296 -0.978948
H  6.211677 -3.160157 -0.658528
H  6.210636 -2.14045 -2.119628
H  4.369275 0.906653 0.898392
H  6.121551 1.252843 0.829765
H  -8.353001 0.390471 -0.413433
H  -7.488171 -0.725641 -1.487934
H  -6.248586 0.789689 0.909883
H  -6.129663 1.296007 -0.798994
H  3.119609 -3.254222 1.280485
H  4.454787 -2.329748 2.043461
H  4.820747 -3.691453 0.945171
H  8.546239 -2.490722 -1.279343
H  8.090868 -1.843594 0.334759
H  8.131046 -0.765138 -1.088828
H  2.834039 1.773267 -1.233547
H  2.751784 3.549128 -1.479439
H  -7.856079 -1.108419 1.563856
H  -7.041582 -2.265253 0.499128
H  2.645388 2.206666 1.310294
H  2.214328 3.897524 0.928997
H  -5.212001 -1.425957 -0.591501
H  0.09019 3.140246 0.134724
H  -9.200352 -2.600904 -0.811547
H  -9.413797 -2.995668 0.917776
H  -10.027131 -1.447078 0.272021
H  -2.887924 -2.008833 -0.6454
H  -4.193765 2.008438 0.452051
H  -0.505212 -1.292141 -0.325789
H  -1.851909 2.686414 0.759896
