program: Gaussian 09
title: 000241935
version: EM64L-G09RevD.01
frameworkgroup: C1[X(C12H23NO)]
method: RPBEPBE
basis: SDD
operation: Freq
keyword: #p
keyword: freq=noraman
keyword: PBEPBE/SDD
title: #p freq=noraman PBEPBE/SDD
converged: YES YES NO NO
title: Mulliken charges:
elementType: O N C C C C C C C C C C C C H H H H H H H H H H H H H H H H H H H H H H H
charge: -0.290317 -0.047011 -0.138651 -0.105893 0.336284 -0.491131 -0.502038 0.021223 -0.440502 -0.732247 -0.743344 -0.319548 -0.751585 -0.692691 0.227829 0.214827 0.203932 0.210418 0.204201 0.215043 0.200724 0.201396 0.192942 0.223178 0.231240 0.204867 0.200580 0.222767 0.238246 0.196540 0.203475 0.214285 0.212670 0.215450 0.219653 0.245909 0.197279
chargesum: 0.00000
title: Mulliken charges with hydrogens summed into heavy atoms:
elementType: O N C C C C C C C C C C C C
charge: -0.290317 -0.047011 0.089178 0.108934 0.336284 -0.076782 -0.082794 0.221947 -0.046164 -0.072962 -0.081750 0.080467 -0.109180 -0.029850
polarizability: 1.53855811e+02 1.78809570e+00 1.47839009e+02 -3.15048700e-01 4.41801442e-01 1.12625509e+02
1716.lowfreq: -10.3653 -0.0006 -0.0005 0.0007 13.5292 18.8659 50.7168 80.7017 87.5285
frequency: 50.6918 80.6916 87.5199 113.2391 165.1588 186.3574 197.6957 203.5940 208.3666 226.3414 248.4825 261.1593 280.1020 302.8435 313.8141 353.2224 380.0160 413.1346 424.0749 473.3178 479.9657 498.9251 531.8005 552.8047 591.0160 748.0516 760.5574 783.6525 812.5682 828.4933 837.9499 880.1460 894.3601 912.9046 919.3093 932.5336 961.7240 990.4120 994.8007 1012.3193 1018.7231 1057.2620 1084.4284 1092.2247 1096.4671 1119.5259 1123.8268 1132.2377 1159.2888 1169.4357 1176.1160 1192.8881 1226.8473 1243.8827 1262.2395 1264.3706 1277.6333 1280.2665 1304.8600 1312.9786 1328.0185 1333.7230 1348.9117 1352.0875 1360.7902 1363.4977 1370.7386 1385.7909 1386.5658 1389.8090 1442.2981 1450.9994 1458.4812 1463.2251 1464.0118 1467.2866 1469.1684 1472.8371 1474.8984 1478.0949 1482.8666 1490.0405 2863.7162 2910.0480 2943.9240 2961.9955 2966.7488 2971.5490 2975.3952 2976.0020 2978.9290 2983.4843 2991.4132 3014.9492 3023.4839 3034.7355 3040.8192 3062.1258 3065.7884 3070.5229 3079.6621 3086.2005 3087.6772 3094.4721 3107.1437
redmass: 3.2684 3.0424 2.4055 2.8068 1.9559 1.7435 2.0389 1.0770 1.2110 1.3959 1.3363 1.7353 2.2526 2.9464 2.5012 2.8359 2.8784 3.2413 1.9319 3.1157 3.1672 3.0120 2.9283 3.8084 2.8950 3.0378 3.0427 2.2842 1.4164 2.7345 2.0574 2.3159 1.8887 1.6996 1.5076 1.8187 1.3948 1.3313 2.4783 2.3259 1.8189 1.3058 2.2989 2.2275 1.8546 2.1467 2.2541 2.1615 2.2563 2.6492 2.1259 2.5024 1.3738 1.5961 2.3208 1.2521 1.3198 1.2932 1.2778 1.3484 1.3803 1.3831 1.5449 1.6799 1.4477 1.4169 1.2394 1.2380 1.2251 1.2315 1.0809 1.0547 1.0877 1.0427 1.0600 1.0645 1.0723 1.0665 1.0703 1.0607 1.0509 1.0508 1.0797 1.0656 1.0814 1.0609 1.0382 1.0723 1.0541 1.0453 1.0639 1.0378 1.0364 1.0916 1.0987 1.1029 1.1026 1.0991 1.0993 1.0980 1.0987 1.0995 1.1001 1.1001 1.1001
irintensity: 1.7657 0.8252 0.0727 0.1949 0.2676 0.5473 0.4239 0.1051 0.0415 0.2115 0.2574 0.3605 0.1027 1.0956 0.2494 0.7692 2.7573 3.4321 1.4716 2.1565 0.1461 2.8387 4.7457 4.4339 0.9560 5.8828 9.1079 13.0650 13.8886 29.7634 2.3576 1.8553 1.3974 0.9868 0.9028 11.7921 3.5974 0.4739 3.7925 2.8548 5.7024 0.9044 4.9470 0.7093 1.6988 3.1128 12.2238 15.4636 12.8880 8.2308 10.0914 12.1992 1.9539 5.2362 16.0551 0.3165 11.2599 0.6439 0.2319 5.1926 14.4539 1.5253 4.7982 2.6530 5.0842 5.4489 30.2835 18.8310 15.2878 18.3903 3.0740 0.3639 1.6524 13.1554 1.3025 16.1632 0.3659 17.5614 10.5823 5.9954 14.1320 9.2801 38.0585 65.6936 13.7398 31.1347 42.3859 13.0940 51.8520 30.7985 20.7011 34.7787 38.7543 24.3971 44.2237 6.3095 64.1372 70.7019 40.8489 11.6280 46.4504 37.6192 29.6541 37.2754 26.5789
temp: 298.150 k
press: 1.00000 atm
elementType: 8 7 6 6 6 6 6 6 6 6 6 6 6 6 1 1 1 1 1 1 1 1 1 1 1 1 1 1 1 1 1 1 1 1 1 1 1
symmnumber: 1
zpe: 867379.6 jmol-1
zpe.correction: 0.330367 hartree
zpe.thermalcorrener: 0.345858 hartree
zpe.thermalcorrenthalpy: 0.346802 hartree
zpe.thermalcorrgfe: 0.289190 hartree
zpe.sumelectzpe: -599.860893 hartree
zpe.sumelectthermal: -599.845402 hartree
zpe.sumelectthermalent: -599.844458 hartree
zpe.sumelectthermalfe: -599.902070 hartree
dipole: 2.2713 -0.4101 0.8664
dipole: 2.4653
quadrupole: -91.6519 -83.5560 -88.5135
quadrupole: 0.2968 -0.7966 1.7711
quadrupole: -3.7447 4.3511 -0.6064 0.2968 -0.7966 1.7711
hfenergy: -600.1912601 hartree
pointgroup: C01 [X(C12H23N1O1)]
dipole: 0.8957061 0.1431521 -0.3434972 debye
polarizability: 153.8211686|-1.8313033|147.8674991|0.4517084|-0.5983959|112.6316613 unknown
InChI: InChI=1S/C12H23NO/c1-5-13-11-8-9(2)6-7-10(11)12(3,4)14-13/h9-11H,5-8H2,1-4H3
charge 0 multiplicity 1
37 atoms
O  -2.077603 0.160117 -0.125223
N  -1.142191 -1.004801 0.313536
C  0.185909 0.924998 0.250161
C  0.156706 -0.530651 -0.253349
C  -1.263269 1.431108 -0.026864
C  1.398657 1.678362 -0.321013
C  1.400739 -1.296614 0.218629
C  2.678434 -0.578305 -0.306206
C  2.690596 0.924157 0.095771
C  -1.442258 2.140253 -1.382513
C  -1.819606 2.271038 1.137367
C  -1.709371 -2.1871 -0.388694
C  3.955631 -1.297492 0.177656
C  -3.066998 -2.595079 0.203171
H  0.308965 0.870708 1.352086
H  0.120545 -0.535741 -1.372421
H  1.43349 2.719567 0.055472
H  1.337684 1.734796 -1.425843
H  1.389811 -2.343596 -0.143675
H  1.410505 -1.330345 1.32652
H  2.6528 -0.625147 -1.417399
H  3.576756 1.414049 -0.353582
H  2.810984 0.995101 1.197608
H  -1.005857 1.547088 -2.204904
H  -2.518693 2.26997 -1.592257
H  -0.968739 3.139455 -1.372265
H  -1.205649 3.178194 1.298062
H  -2.857426 2.587111 0.929891
H  -1.819085 1.673805 2.065435
H  -1.801321 -1.985787 -1.481483
H  -0.972269 -3.003026 -0.248473
H  4.865823 -0.815158 -0.225183
H  4.023461 -1.276144 1.282493
H  3.964916 -2.357223 -0.139335
H  -2.968217 -2.805549 1.282622
H  -3.796902 -1.778446 0.077566
H  -3.455756 -3.499173 -0.300461
