program: Gaussian 09
title: 000241931
version: EM64L-G09RevD.01
frameworkgroup: C1[X(C11H14N6O)]
method: RPBEPBE
basis: SDD
operation: Freq
keyword: #p
keyword: freq=noraman
keyword: PBEPBE/SDD
title: #p freq=noraman PBEPBE/SDD
converged: YES YES NO NO
title: Mulliken charges:
elementType: O N N N N N N C C C C C C C C C C C H H H H H H H H H H H H H H
charge: -0.269110 -0.453888 -0.153008 -0.133274 -0.716613 -0.637504 -0.593125 0.449579 0.228885 -0.085600 -0.483875 -0.318565 0.201108 0.317466 -0.326830 -0.360322 -0.012814 -0.538228 0.336564 0.217743 0.310614 0.235304 0.242373 0.299859 0.299999 0.324755 0.301375 0.320889 0.322401 0.216227 0.216329 0.241285
chargesum: 0.00000
title: Mulliken charges with hydrogens summed into heavy atoms:
elementType: O N N N N N N C C C C C C C C C C C
charge: -0.269110 -0.117324 -0.153008 -0.133274 -0.116755 -0.011374 0.050165 0.449579 0.228885 -0.085600 -0.266132 -0.007951 0.201108 0.317466 -0.091526 -0.117949 -0.012814 0.135612
polarizability: 3.12747778e+02 -9.42430739e-01 1.84512363e+02 9.87343764e-02 1.12671875e-01 7.49090413e+01
1716.lowfreq: -0.0009 -0.0007 0.0005 4.4602 8.0660 9.6913 37.0133 44.1841 77.7752
frequency: 37.0120 43.7150 77.7740 85.5323 113.2541 157.0862 189.9746 206.5168 209.5825 216.9027 254.3893 286.2540 295.0923 296.2763 302.5661 350.1409 376.2377 407.0123 417.3395 419.2676 432.0065 465.9155 487.8356 513.3643 518.3331 521.3290 523.5085 559.7742 576.6725 629.6046 656.0408 699.4150 722.4943 724.2110 729.3313 762.9829 774.4261 789.4373 819.6227 829.5183 849.5445 915.9856 936.7865 989.5978 990.1405 1000.5068 1011.1787 1106.6051 1113.0593 1116.8497 1118.5653 1128.5326 1156.7494 1178.2725 1214.3824 1223.6919 1267.9818 1300.8022 1326.5532 1362.0651 1415.0230 1418.2081 1435.6115 1438.3747 1466.1486 1473.7038 1476.1517 1496.9829 1523.3944 1551.0713 1574.5904 1589.4599 1594.2368 1613.1947 1624.9182 1634.9876 2950.3933 3033.9577 3112.0167 3118.8351 3154.8233 3159.2827 3187.8939 3408.0850 3463.2606 3556.6909 3568.0330 3578.8480 3712.8086 3728.5893
redmass: 4.8080 3.8632 5.2824 3.7771 4.2802 4.6805 4.0539 6.3400 5.2021 2.8204 1.2903 3.4533 3.4299 1.9591 1.8477 3.7528 5.1798 1.1739 1.9630 1.5442 4.5866 1.1372 6.0444 1.0767 4.4604 1.0959 2.1429 7.0864 4.6386 6.9370 6.5691 8.5998 5.0623 3.5810 5.5632 4.4210 8.2340 1.5284 1.2713 5.4788 1.4780 1.3852 2.1776 7.6571 1.3104 2.9782 3.3368 1.6330 1.2605 1.2945 2.1195 2.2379 1.3364 1.2338 2.5800 4.1566 2.8145 1.4168 6.0152 5.2343 4.3713 3.9352 1.7459 1.8651 1.0503 2.2799 1.2160 2.6242 3.5998 4.1649 3.2420 2.5153 1.7456 1.6722 1.3247 5.5183 1.0333 1.1034 1.0894 1.0986 1.0904 1.0933 1.0953 1.0743 1.0429 1.0438 1.0439 1.1015 1.1048 1.1059
irintensity: 2.0981 0.1052 0.5986 3.0512 0.3788 16.0692 0.4645 4.6142 10.7691 0.0009 1.2598 9.4377 15.5000 39.7421 39.4235 2.1729 18.7097 20.8951 160.3454 290.1673 7.3962 164.5659 1.7742 0.0724 47.9958 16.1681 34.9920 0.2264 2.0255 0.2500 4.7970 0.1108 7.1636 0.0672 5.6306 11.9750 4.9053 2.2028 139.5145 7.7143 66.1947 3.9130 17.3119 53.2036 2.5281 10.4074 31.4174 15.7001 0.2620 2.3362 6.0805 6.3271 0.2491 64.9058 237.8954 46.7425 0.3244 0.5443 20.0486 3.5183 121.7115 77.3436 62.8263 48.7478 12.3682 205.3402 126.4959 262.7059 422.5753 1098.0661 14.4516 116.0442 711.3484 170.3857 132.5405 27.2331 96.5816 57.4700 27.5167 24.9742 7.6208 17.1084 15.2762 76.1261 1.6265 86.2082 89.6199 8.4208 37.2804 40.4012
temp: 298.150 k
press: 1.00000 atm
elementType: 8 7 7 7 7 7 7 6 6 6 6 6 6 6 6 6 6 6 1 1 1 1 1 1 1 1 1 1 1 1 1 1
symmnumber: 1
zpe: 663001.4 jmol-1
zpe.correction: 0.252524 hartree
zpe.thermalcorrener: 0.269599 hartree
zpe.thermalcorrenthalpy: 0.270543 hartree
zpe.thermalcorrgfe: 0.208234 hartree
zpe.sumelectzpe: -830.014217 hartree
zpe.sumelectthermal: -829.997142 hartree
zpe.sumelectthermalent: -829.996198 hartree
zpe.sumelectthermalfe: -830.058507 hartree
dipole: 1.8983 -4.0556 0.0094
dipole: 4.4779
quadrupole: -78.7492 -81.4982 -110.9854
quadrupole: -1.5535 0.0971 -0.0149
quadrupole: 11.6617 8.9127 -20.5744 -1.5535 0.0971 -0.0149
hfenergy: -830.2667408 hartree
pointgroup: C01 [X(C11H14N6O1)]
dipole: 0.7281562 -1.5807301 0.2734497 debye
polarizability: 312.3734451|-4.0156935|180.8763558|-8.3333486|-19.7019718|78.9193816 unknown
InChI: InChI=1S/C11H14N6O/c1-18-7-4-2-6(3-5-7)15-10-8(12)9(13)16-11(14)17-10/h2-5,15H,12-14H2,1H3
charge 0 multiplicity 1
32 atoms
O  -5.188113 0.866838 0.059118
N  0.191492 -0.913706 0.173353
N  1.481464 1.069518 -0.25097
N  3.932787 0.898451 -0.306985
N  2.423824 -2.504801 0.395543
N  5.021108 -1.141158 0.043704
N  2.835566 2.929485 -0.653533
C  -1.140228 -0.438308 0.136032
C  1.406757 -0.273237 0.007447
C  2.576252 -1.099323 0.12252
C  -2.179486 -1.382646 0.34791
C  -1.491512 0.922776 -0.097662
C  3.82912 -0.446797 -0.046516
C  -3.873174 0.359425 0.098759
C  -3.536642 -0.996269 0.331021
C  -2.842962 1.307599 -0.114155
C  2.748498 1.577566 -0.394261
C  -6.275472 -0.085414 0.275449
H  0.338292 -1.91704 0.35608
H  -1.927002 -2.435419 0.529345
H  -0.69105 1.645769 -0.260882
H  -4.308165 -1.753887 0.498148
H  -3.123465 2.350658 -0.292684
H  2.618478 -3.164873 -0.361453
H  2.671954 -2.841837 1.329159
H  5.887896 -0.625895 -0.086333
H  5.029057 -2.138386 0.234277
H  1.982603 3.475391 -0.726876
H  3.752111 3.351824 -0.76617
H  -6.2094 -0.556796 1.276578
H  -6.284203 -0.875301 -0.502209
H  -7.198884 0.508994 0.207746
