program: Gaussian 09
title: 000226297
version: EM64L-G09RevD.01
frameworkgroup: C1[X(C10H12O3)]
method: RPBEPBE
basis: SDD
operation: Freq
keyword: #pfreq=noraman
keyword: PBEPBE/SDD
title: #p freq=noraman PBEPBE/SDD
converged: YES YES NO NO
title: Mulliken charges:
elementType: O O O C C C C C C C C C C H H H H H H H H H H H H
charge: -0.195052 -0.153295 -0.154458 -0.306218 -0.227148 -0.543210 -0.542920 0.260664 0.244181 0.173027 0.162647 -0.824933 -0.811088 0.294341 0.291392 0.238827 0.241344 0.214963 0.261313 0.226869 0.233468 0.229281 0.227329 0.232276 0.226401
chargesum: 0.00000
title: Mulliken charges with hydrogens summed into heavy atoms:
elementType: O O O C C C C C C C C C C
charge: -0.195052 -0.153295 -0.154458 -0.011876 0.064244 -0.063039 -0.066645 0.260664 0.244181 0.173027 0.162647 -0.135315 -0.125082
polarizability: 1.20192497e+02 7.66723834e+00 1.29435017e+02 1.36456237e+00 9.92068108e-01 7.97636824e+01
1716.lowfreq: -13.5954 -0.0004 -0.0002 0.0002 6.5818 14.6368 17.2427 74.7885 122.3737
frequency: -6.9588 74.7490 122.3657 135.7189 136.9787 158.8013 175.7802 224.4237 287.0530 316.0788 348.2715 368.6788 421.7609 445.8114 491.1231 521.6766 571.4046 595.5020 643.2161 668.6494 710.1344 725.2508 764.3759 803.8557 889.1545 902.8800 922.5856 929.2390 989.8708 1006.2028 1033.5775 1051.8330 1076.8670 1107.1728 1133.0894 1138.2262 1162.9674 1187.3779 1207.5192 1236.4043 1244.8843 1269.0444 1292.7270 1318.0565 1335.9785 1355.4882 1391.1964 1405.6671 1461.9507 1464.1896 1467.3141 1473.2284 1475.8781 1481.9885 1703.0924 1709.1232 1771.8200 2959.3906 2962.8542 2965.1754 2968.7130 2977.9254 3017.7346 3028.3789 3030.3628 3039.7965 3077.6587 3098.9451 3107.9361
redmass: 3.6642 3.8010 1.0516 3.1342 2.1651 1.8461 3.0600 3.3650 2.6227 4.1212 2.8179 3.6748 4.7843 4.9786 2.7637 4.1736 6.3171 7.0833 5.3810 5.5090 4.2718 4.1372 3.5309 9.9761 2.5875 1.8317 1.8563 3.3540 1.4171 2.0140 1.5212 1.8558 2.4146 5.1810 2.9095 3.3224 1.6249 1.9823 1.1550 1.4271 2.0539 1.3713 1.5247 1.2882 1.6925 1.7750 1.2800 1.1992 1.0568 1.0507 1.0649 1.0641 1.0674 1.0775 12.7849 6.6082 12.5867 1.0622 1.0449 1.0461 1.0571 1.0828 1.0960 1.0968 1.0965 1.0935 1.0876 1.0964 1.0927
irintensity: 1.5901 0.8886 1.1063 2.8327 1.1088 1.0035 1.5094 4.0758 5.3094 5.2468 2.4349 5.8731 3.5696 2.4326 2.0524 19.4852 6.3446 7.4606 18.9028 1.1651 6.4076 5.0272 4.2311 228.1487 3.1063 7.2462 0.5918 69.0681 4.1500 56.7451 10.0684 6.0023 8.9414 123.6626 25.0309 34.5181 3.5507 5.8772 1.9858 3.1874 3.4881 4.6333 1.5626 3.6837 5.9969 4.0005 8.7583 11.1782 1.7700 3.0606 24.3272 11.2649 8.9870 18.6391 479.7198 0.9072 108.1514 10.7292 38.9161 20.0587 48.9403 8.6382 20.1463 13.6366 32.8833 13.0087 9.6840 16.7228 39.4704
temp: 298.150 k
press: 1.00000 atm
elementType: 8 8 8 6 6 6 6 6 6 6 6 6 6 1 1 1 1 1 1 1 1 1 1 1 1
symmnumber: 1
zpe: 523624.2 jmol-1
zpe.correction: 0.199438 hartree
zpe.thermalcorrener: 0.210979 hartree
zpe.thermalcorrenthalpy: 0.211923 hartree
zpe.thermalcorrgfe: 0.162188 hartree
zpe.sumelectzpe: -612.962545 hartree
zpe.sumelectthermal: -612.951004 hartree
zpe.sumelectthermalent: -612.950060 hartree
zpe.sumelectthermalfe: -612.999795 hartree
dipole: 5.4134 -0.2407 2.1963
dipole: 5.8469
quadrupole: -88.5143 -83.0510 -74.9778
quadrupole: -2.0577 -4.2277 6.2948
quadrupole: -6.3333 -0.8700 7.2032 -2.0577 -4.2277 6.2948
hfenergy: -613.1619832 hartree
pointgroup: C01 [X(C10H12O3)]
dipole: 2.1454854 -0.2597008 0.7881125 debye
dipolederiv: -0.6937497 -0.3094057 -0.022801 -0.3210811 -1.5620723 0.3383163 -0.1398201 0.3652314 -0.3301746 -0.7676161 -0.3659773 0.0694315 -0.3740037 -0.8994789 0.1673125 -0.0254379 0.1078685 -0.3292563 -0.4785237 0.0424521 -0.0761545 0.0099906 -0.9890973 0.2534718 -0.1058637 0.3575449 -0.4488766 -0.4320553 -0.0145583 -0.0491825 -0.0443141 0.0111935 -0.0264213 0.0514321 -0.0068389 0.1067582 -0.1289391 -0.0065666 -0.1362728 0.08602 -0.0748563 0.0750914 -0.2747021 0.1046989 -0.04273 -0.0073714 0.0490927 0.0393078 -0.0767413 0.1188985 -0.0350102 -0.1526778 -0.0588299 0.1348094 0.0176165 -0.0010731 0.024061 0.1260907 -0.0075229 0.0002854 0.0398372 0.0568748 0.1654786 0.1535331 -0.0791649 -0.0193919 0.0174451 0.0566778 0.0742246 0.0816516 0.1313548 -0.1117046 0.1741043 0.0271434 0.0058459 -0.0428279 0.12959 0.082024 -0.0093049 0.0224852 -0.1270696 1.1767524 0.0834199 0.0846234 0.4479574 1.7022504 -0.435785 0.1297498 -0.5480244 0.3816949 0.9414911 0.5283866 0.141821 0.1783796 1.5881782 -0.4298353 0.4118257 -0.4096855 0.5339984 -0.0797976 0.0325389 0.0257308 0.0355457 -0.0445669 -0.0562459 0.0229148 -0.0520544 0.0874154 -0.1165279 -0.0096879 0.0072725 -0.028057 0.0085254 -0.0322525 -0.0109112 -0.0368126 0.0898087 0.0845298 0.0303832 -0.0311023 0.0035167 0.0215676 0.0526693 -0.0237875 0.0535803 -0.034799 0.0228506 0.0282204 0.0502241 0.0407705 0.0505591 -0.0295727 0.0752137 -0.0505698 -0.0185327 -0.0290491 -0.0410435 -0.0779378 0.0227985 0.0550516 0.0647137 -0.0642182 0.0148222 -0.0700051 0.0453297 -0.0102057 0.0050713 -0.0130075 -0.1314087 -0.0203205 0.032921 0.0075382 0.0773638 0.0066186 -0.0347817 -0.0503481 -0.0402579 0.0080257 -0.0761329 -0.0510736 -0.1435712 -0.0712638 0.0715533 0.0502244 0.012639 -0.0203902 -0.0297948 0.0391538 0.0289131 0.0870821 0.0146173 -0.1637523 -0.0160261 0.0178442 -0.0799885 0.0847281 0.0030206 -0.0110091 -0.0019594 0.1002349 0.0813259 0.0134581 -0.0686993 0.011611 0.0407597 -0.0634787 -0.0241817 -0.1145052 -0.1159327 0.0824295 -0.0068203 0.0486416 0.0173983 -0.11428 0.0697299 0.010137 0.1230244 0.0190517 0.0417018 -0.0456433 -0.0183575 -0.0402847 0.0669666 -0.0541176 -0.086768 -0.0856703 -0.1346786 0.0630089 -0.0196602 -0.0284518 -0.0671362 -0.1087434 0.0901617 0.0232347 0.1166486 0.0499836 -0.0654633 0.075295 0.0461856 0.1505658 0.0188496 -0.0510024 0.0719251 -0.0402326 0.0738088 unknown
polarizability: 121.2061623|8.1803885|128.3127428|0.5237129|2.8379471|79.8722921 unknown
InChI: InChI=1S/C10H12O3/c1-5-3-7-8(4-6(5)2)10(12)13-9(7)11/h7-8H,3-4H2,1-2H3
charge 0 multiplicity 1
25 atoms
O  -2.587249 0.345766 -0.248738
O  -2.862985 -1.866022 0.471596
O  -1.637401 2.432007 -0.717767
C  -0.644866 -0.717149 0.715432
C  -0.467589 0.817405 0.81303
C  0.23252 -1.320304 -0.418775
C  0.954746 1.373008 0.547584
C  1.696048 -0.903518 -0.286977
C  2.019271 0.345347 0.162983
C  -2.119816 -0.889918 0.362452
C  -1.551281 1.350702 -0.132997
C  2.681233 -1.967653 -0.73142
C  3.431003 0.885499 0.304369
H  -0.412777 -1.23431 1.659908
H  -0.796037 1.137033 1.823727
H  -0.161793 -1.003319 -1.407784
H  0.143501 -2.421732 -0.390212
H  1.307624 1.91659 1.445147
H  0.888915 2.145516 -0.246878
H  3.73023 -1.634072 -0.707509
H  2.456932 -2.295914 -1.765985
H  2.598554 -2.869531 -0.092477
H  3.661466 1.110256 1.365093
H  3.539843 1.839128 -0.249283
H  4.204208 0.195385 -0.066619
