program: Gaussian 09
title: 000241928
version: EM64L-G09RevD.01
frameworkgroup: C1[X(C11H12N4O)]
method: RPBEPBE
basis: SDD
operation: Freq
keyword: #p
keyword: freq=noraman
keyword: PBEPBE/SDD
title: #p freq=noraman PBEPBE/SDD
converged: NO YES NO NO
title: Mulliken charges:
elementType: O N N N N C C C C C C C C C C C H H H H H H H H H H H H
charge: -0.248128 -0.493171 -0.464503 -0.039364 -0.629361 0.257878 0.281307 0.468960 -0.404705 -0.377965 -0.833134 -0.493973 -0.228569 -0.249545 0.152303 0.035647 0.330300 0.277186 0.234186 0.333945 0.228930 0.241707 0.242335 0.248962 0.231939 0.232901 0.309506 0.354423
chargesum: 0.00000
title: Mulliken charges with hydrogens summed into heavy atoms:
elementType: O N N N N C C C C C C C C C C C
charge: -0.248128 -0.162871 -0.130558 -0.039364 0.034569 0.257878 0.281307 0.468960 -0.127519 -0.143778 -0.120162 -0.245011 0.003370 -0.016644 0.152303 0.035647
polarizability: 2.38500948e+02 2.28408738e+01 1.59754914e+02 1.19686059e+01 -1.04937356e+00 8.58290563e+01
1716.lowfreq: -0.0004 0.0002 0.0005 5.0490 6.4482 9.9499 34.4715 46.1039 72.6691
frequency: 34.3384 46.0320 72.6677 127.1137 162.1031 179.2900 189.3679 199.6193 228.5051 232.7703 242.6311 310.7390 341.1816 408.6118 442.4299 469.9360 487.4856 512.3745 515.9020 539.1829 546.1988 553.0999 560.0187 607.6454 616.6040 672.9814 693.5777 721.3585 725.6251 758.9951 783.2396 824.8909 834.6273 872.6948 883.1686 945.9846 957.5225 982.2477 982.9456 1023.2146 1042.7318 1051.3643 1099.6450 1110.4607 1175.6220 1183.7365 1207.2784 1219.8905 1273.6235 1304.6683 1314.7983 1366.8850 1398.5409 1412.3350 1422.4997 1439.0913 1464.1694 1473.1892 1487.8839 1499.8966 1575.1086 1590.8173 1598.3544 1613.6339 1634.8054 1662.1502 2957.9664 3032.9251 3090.9409 3126.6267 3135.0613 3152.1096 3168.1705 3180.8431 3529.2049 3551.6718 3564.0167 3704.0096
redmass: 5.7295 4.2900 4.8834 4.1124 3.8307 1.3773 2.5392 5.7782 3.2052 1.5369 2.5802 3.6771 3.8274 2.9496 2.8671 1.5368 3.5459 1.2289 4.4426 3.8402 3.3379 1.3751 5.6023 5.6059 6.4178 4.9739 6.5834 3.6554 4.0870 1.2979 4.0349 3.0113 2.2143 1.2893 4.1227 1.3575 2.8319 1.5959 1.3140 4.1695 1.5555 2.0663 2.2091 1.9005 1.1588 1.9131 2.2222 2.3055 1.8725 1.8559 1.5653 4.7511 1.3152 4.1389 3.8872 2.1306 1.7960 1.1796 1.2191 2.4263 5.2176 4.1420 1.6426 5.7609 3.3097 5.2641 1.0420 1.0939 1.0967 1.0867 1.0889 1.0936 1.1007 1.0931 1.0775 1.0457 1.0761 1.1051
irintensity: 7.5564 3.0461 2.2273 4.9283 4.6091 1.9315 1.3584 1.0064 14.6442 52.9004 13.7780 10.9004 3.7640 5.5267 39.7094 64.2308 27.7779 286.7859 33.7856 8.4384 6.7182 30.7843 0.0566 1.1503 3.9071 17.5825 8.0872 2.6120 2.5906 70.2075 10.0860 29.0130 36.5621 1.2893 12.3608 0.9128 10.0932 5.2597 0.4812 15.0887 7.0444 11.5355 29.9995 10.8090 0.0685 3.9058 3.5677 86.0225 19.1783 89.7326 77.0930 35.7965 25.7411 87.4678 169.5549 8.3696 115.2488 15.9027 102.2076 86.8495 387.7070 56.6093 39.9288 138.9896 524.8713 671.2370 27.9396 19.3638 16.6159 9.2097 9.3150 22.2829 18.0827 6.7778 45.3379 80.4330 31.8154 42.2199
temp: 298.150 k
press: 1.00000 atm
elementType: 8 7 7 7 7 6 6 6 6 6 6 6 6 6 6 6 1 1 1 1 1 1 1 1 1 1 1 1
symmnumber: 1
zpe: 574839.4 jmol-1
zpe.correction: 0.218945 hartree
zpe.thermalcorrener: 0.233535 hartree
zpe.thermalcorrenthalpy: 0.234479 hartree
zpe.thermalcorrgfe: 0.177110 hartree
zpe.sumelectzpe: -719.471500 hartree
zpe.sumelectthermal: -719.456910 hartree
zpe.sumelectthermalent: -719.455965 hartree
zpe.sumelectthermalfe: -719.513334 hartree
dipole: 8.9202 3.5423 2.4702
dipole: 9.9106
quadrupole: -127.3419 -76.7836 -95.5203
quadrupole: -17.7735 -4.8271 0.3149
quadrupole: -27.4600 23.0984 4.3616 -17.7735 -4.8271 0.3149
hfenergy: -719.6904445 hartree
pointgroup: C01 [X(C11H12N4O1)]
dipole: -3.5269341 1.383278 -0.9222841 debye
polarizability: 239.0593035|-22.2793946|159.0668543|11.031553|3.6341361|85.9587613 unknown
InChI: InChI=1S/C11H12N4O/c1-7-4-2-3-5-8(7)13-9-6-10(16)15-11(12)14-9/h2-6,13-14H,12H2,1H3
charge 0 multiplicity 1
28 atoms
O  4.396438 -1.493214 0.560149
N  -0.412602 -1.06271 0.017676
N  1.106927 0.723668 -0.444446
N  3.49749 0.551047 -0.175929
N  2.534772 2.539018 -0.953923
C  -1.61397 -0.309706 0.141333
C  -2.81503 -0.84535 -0.423864
C  0.904705 -0.582145 0.033515
C  -1.645122 0.927867 0.841934
C  -4.011016 -0.10493 -0.280277
C  -2.799085 -2.175941 -1.154082
C  2.000479 -1.334477 0.405803
C  -2.851118 1.652294 0.951699
C  -4.041169 1.140805 0.388333
C  2.416453 1.235484 -0.503237
C  3.371979 -0.80562 0.274135
H  -0.500188 -2.07822 -0.020581
H  -0.742687 1.294738 1.3414
H  -4.934086 -0.510935 -0.710854
H  0.311282 1.241958 -0.822051
H  -2.588089 -3.025615 -0.472242
H  -3.7764 -2.379152 -1.62186
H  -2.030904 -2.195013 -1.950739
H  1.878864 -2.343405 0.807079
H  -2.861821 2.601195 1.499224
H  -4.980743 1.695639 0.476946
H  1.7417 3.154736 -1.111962
H  3.48164 2.905484 -1.016479
