program: Gaussian 09
title: 000226290
version: EM64L-G09RevD.01
frameworkgroup: C1[X(C8H10N4O2)]
method: RPBEPBE
basis: SDD
operation: Freq
keyword: #p
keyword: freq=noraman
keyword: PBEPBE/SDD
title: #p freq=noraman PBEPBE/SDD
converged: YES YES NO NO
title: Mulliken charges:
elementType: O O N N N N C C C C C C C C H H H H H H H H H H
charge: -0.247959 -0.251860 -0.593824 -0.620284 0.037969 0.033201 -0.147527 0.159258 -0.506247 -0.736142 0.223277 0.173994 -0.209213 -0.234288 0.280909 0.232282 0.253353 0.240424 0.256934 0.232148 0.356598 0.363739 0.331179 0.372078
chargesum: 0.00000
title: Mulliken charges with hydrogens summed into heavy atoms:
elementType: O O N N N N C C C C C C C C
charge: -0.247959 -0.251860 0.126513 0.082972 0.037969 0.033201 0.133383 0.159258 -0.020612 -0.006636 0.223277 0.173994 -0.209213 -0.234288
polarizability: 1.28665605e+02 1.41795827e+00 1.04399294e+02 -2.49138747e+00 -5.14557000e+00 1.01067243e+02
1716.lowfreq: -15.9388 -6.8534 -6.0134 -0.0009 -0.0006 -0.0005 31.5754 58.4075 76.6582
frequency: 31.4687 58.3038 76.6448 84.3330 112.2616 115.9938 140.5403 166.4110 176.2778 206.3421 242.2502 278.0979 319.9173 388.1131 399.9359 411.4481 423.7221 468.7057 475.8075 535.1149 540.2246 564.0405 576.8868 606.3854 627.3905 646.2540 705.0783 719.5394 724.9651 857.6529 880.8512 901.9621 932.3166 973.2333 1028.7111 1054.7488 1077.1002 1102.0418 1116.2265 1143.2163 1214.3587 1274.4285 1305.7153 1314.0094 1337.6666 1344.8513 1401.6836 1458.3340 1476.3960 1479.3457 1596.0068 1610.3278 1647.9957 1672.3491 2186.3643 2189.9790 2987.2129 3009.9608 3026.6785 3083.8810 3091.5155 3095.9639 3448.1229 3506.2885 3635.0497 3651.5803
redmass: 5.1838 6.8486 5.8944 5.0043 7.4249 9.0089 7.9470 5.5461 4.6938 3.4420 1.1477 6.3020 3.2660 4.2967 4.9395 4.0958 2.3632 6.6729 6.3819 3.3812 1.2089 11.5697 1.6084 2.9022 1.4285 2.4322 2.7729 2.6779 1.3927 3.4053 2.8404 2.8581 2.2825 2.4893 4.3270 1.6604 1.9401 3.7360 1.8906 2.3952 1.3632 1.3167 1.8044 2.4643 1.5111 2.4972 1.1968 1.0777 1.0440 1.0502 1.4812 1.2601 4.2050 4.1702 12.6523 12.6668 1.0366 1.0631 1.0844 1.1000 1.0994 1.0998 1.0505 1.0459 1.1003 1.1047
irintensity: 6.4200 2.7063 14.2060 3.0917 0.7164 4.6414 8.1071 3.5503 3.4634 5.3960 0.4854 3.6205 0.5465 6.8137 2.7323 1.3458 6.9450 1.3151 2.5330 5.6179 24.2272 2.1535 58.6959 6.2327 212.0267 107.7129 31.7315 12.4296 135.4013 1.9902 1.9569 1.7697 5.4901 3.9120 4.7973 3.4412 5.2952 4.5861 3.7210 10.8672 18.8167 7.2709 69.6178 57.3974 49.5002 84.7284 20.5138 12.8862 16.7872 3.8719 192.7833 94.6212 309.7012 285.9117 2.9086 4.8142 11.0567 14.9545 1.3972 16.2908 7.6520 14.2409 122.5120 71.5205 88.1137 52.0135
temp: 298.150 k
press: 1.00000 atm
elementType: 8 8 7 7 7 7 6 6 6 6 6 6 6 6 1 1 1 1 1 1 1 1 1 1
symmnumber: 1
zpe: 472145.6 jmol-1
zpe.correction: 0.179831 hartree
zpe.thermalcorrener: 0.194823 hartree
zpe.thermalcorrenthalpy: 0.195768 hartree
zpe.thermalcorrgfe: 0.137340 hartree
zpe.sumelectzpe: -679.256838 hartree
zpe.sumelectthermal: -679.241845 hartree
zpe.sumelectthermalent: -679.240901 hartree
zpe.sumelectthermalfe: -679.299328 hartree
dipole: -2.8769 4.2570 0.2757
dipole: 5.1454
quadrupole: -97.8099 -76.4957 -91.5632
quadrupole: -4.7982 -11.1302 5.0822
quadrupole: -9.1869 12.1272 -2.9403 -4.7982 -11.1302 5.0822
hfenergy: -679.4366686 hartree
pointgroup: C01 [X(C8H10N4O2)]
dipole: -1.1062641 -1.6769145 -0.2493125 debye
dipolederiv: -1.0436066 0.0584518 -0.1857473 0.3508534 -0.7638536 0.0681731 -0.1711283 -0.0005896 -0.3647706 -0.9918465 -0.3138332 0.1551042 -0.1924874 -0.7100372 0.1364786 0.0110811 0.1133138 -0.3819127 -0.935763 -0.2735157 -0.1450022 -0.3448315 -0.4964911 -0.1537299 -0.1999957 -0.1168945 -0.6730655 -0.4624035 0.1086602 0.0243 -0.0359657 -1.0402102 0.1090379 0.0869957 0.1444493 -0.6733298 -0.1765561 -0.0002105 -0.0104847 -0.004993 -0.1763728 0.0058692 0.0570148 -0.0243948 -0.1744774 -0.1972382 0.0081232 -0.0079573 0.0127169 -0.1833345 -0.0238333 -0.0377899 0.0265328 -0.1721586 0.4182925 0.0970193 -0.0221819 0.1404031 0.0969424 0.0513459 -0.0682062 0.1143586 -0.0015013 0.0595717 0.1175105 0.0189892 0.012241 -0.1318554 -0.1088805 -0.0001453 -0.1118195 0.2506626 -0.4053463 0.0906706 0.0203246 0.0962088 0.0421991 0.0240279 -0.0365994 -0.0049958 0.0666929 -0.07299 -0.0740336 -0.0026773 -0.0346817 -0.0341551 -0.0501455 0.0200811 -0.0696948 0.0509026 1.4102772 0.0324606 0.441598 -0.1538807 1.2264805 0.2113621 0.5242434 0.2347164 0.360339 1.2691851 0.1334631 -0.0803601 0.1691088 1.2852824 -0.3992244 0.0854588 -0.4401975 0.2549132 -0.0810902 -0.0014737 -0.0688661 -0.0002854 -0.0916497 0.0188861 -0.1942005 0.1099953 0.0540805 -0.0325584 -0.0814544 0.0731532 -0.0619685 -0.0177431 -0.0462778 0.1496007 -0.1563324 0.0005681 0.0288374 0.0092183 -0.0467497 -0.014037 0.011513 0.0630843 0.0060919 0.0536269 0.0068877 0.019563 -0.0282023 -0.0579652 -0.0494525 -0.0270321 -0.1104487 -0.0651494 -0.0807284 0.0158106 0.0378613 0.0041317 0.0130066 0.0134523 -0.0313722 0.0765464 0.0037796 0.0434102 0.0525464 0.0558094 0.0392 0.1116845 0.0212219 0.0659669 -0.0085512 0.1010464 -0.031224 -0.0664462 -0.0748822 -0.0660969 -0.0382943 -0.0479163 0.0737392 -0.0066755 -0.0267067 -0.0006279 0.1047356 0.068881 0.0701809 -0.0530522 0.0402023 0.0131059 0.0427843 -0.0639374 0.099546 -0.0243521 0.2317072 0.0237843 -0.0708853 0.0661226 0.219948 0.0009463 -0.0616788 -0.0164058 0.3392535 0.2773984 0.0682409 -0.0325866 0.0345657 0.199953 -0.0185257 -0.0493056 -0.0141753 0.3292552 0.1362266 -0.0160313 -0.0204109 -0.0191477 0.2149307 0.0620917 -0.0304043 0.0637246 0.335006 0.4606702 -0.0062635 -0.014939 0.0025505 0.254046 0.0556586 -0.0401463 0.0644061 0.3103604 unknown
polarizability: 128.9386303|-1.4322458|105.7961792|-0.7740964|-4.1769855|99.3973332 unknown
InChI: InChI=1S/C8H10N4O2/c1-5(2-6(11)13)8(3-9,4-10)7(12)14/h5H,2,11-12H2,1H3
charge 0 multiplicity 1
24 atoms
O  0.178465 -2.382941 0.472436
O  4.000364 0.514043 -0.391265
N  -1.930627 -2.125993 -0.458123
N  3.069924 -1.499919 0.328249
N  -2.265431 0.201196 2.693321
N  -1.909103 1.266096 -1.553854
C  0.682938 0.394034 0.72513
C  -0.803285 -0.087985 0.469637
C  1.555818 0.214019 -0.557002
C  0.745431 1.843563 1.246763
C  -0.798594 -1.656432 0.147721
C  2.990706 -0.227055 -0.207221
C  -1.626608 0.08456 1.693173
C  -1.427331 0.665401 -0.642731
H  1.053049 -0.291218 1.509889
H  1.120794 -0.540155 -1.23885
H  1.625525 1.165959 -1.107742
H  0.215972 1.959954 2.208699
H  1.801531 2.125701 1.399473
H  0.311687 2.553684 0.51889
H  -2.003176 -3.125535 -0.652624
H  -2.696895 -1.511892 -0.736555
H  3.985675 -1.864389 0.588766
H  2.22697 -2.067796 0.463819
