program: Gaussian 09
title: 000241925
version: EM64L-G09RevD.01
frameworkgroup: C1[X(C11H13N5)]
method: RPBEPBE
basis: SDD
operation: Freq
keyword: #pfreq=noraman
keyword: PBEPBE/SDD
title: #p freq=noraman PBEPBE/SDD
converged: YES YES NO NO
title: Mulliken charges:
elementType: N N N N N C C C C C C C C C C C H H H H H H H H H H H H H
charge: -0.475181 -0.157826 -0.134773 -0.641251 -0.593685 0.452699 0.501627 -0.635866 0.327326 -0.353134 -0.433641 -0.210154 -0.542025 -0.813516 0.275394 -0.009288 0.214826 0.299283 0.310801 0.228078 0.216702 0.212119 0.220721 0.234021 0.224503 0.325914 0.309783 0.321837 0.324706
chargesum: 0.00000
title: Mulliken charges with hydrogens summed into heavy atoms:
elementType: N N N N N C C C C C C C C C C C
charge: -0.175899 -0.157826 -0.134773 -0.005554 0.052858 0.452699 0.501627 -0.421040 0.327326 -0.042333 -0.205563 0.006548 -0.329906 -0.134271 0.275394 -0.009288
polarizability: 2.74679810e+02 -8.77530640e+00 1.77164289e+02 -2.51846654e-01 -1.32585493e-01 6.74586654e+01
1716.lowfreq: -4.0532 -0.0004 0.0001 0.0007 2.8796 5.1794 25.2926 30.2996 45.8901
frequency: 25.0201 29.8515 45.8702 94.1680 160.5854 190.1865 207.8538 212.3251 217.3934 249.6064 254.4749 320.5375 372.4440 374.1023 427.1335 441.5836 463.6082 482.8627 513.4652 523.0217 541.1615 550.1471 573.9997 604.9666 628.2116 664.6069 675.2502 702.4866 704.8519 751.6167 759.9316 796.4721 800.8195 867.6767 897.4201 912.3549 919.5237 950.9387 984.9379 993.9090 1003.6451 1014.4332 1046.5739 1089.7189 1111.8608 1128.3570 1177.2213 1178.1318 1212.0512 1277.8673 1312.2768 1325.3125 1366.1227 1395.5425 1400.9129 1426.2942 1443.4314 1472.3514 1474.2605 1480.7995 1497.3562 1519.0069 1569.4554 1578.8494 1601.1911 1609.1861 1617.9107 1628.7340 2973.9750 3055.1031 3083.0577 3090.3531 3120.4510 3144.1713 3144.8069 3198.4628 3538.5553 3556.3978 3567.1562 3712.7596 3727.3427
redmass: 1.1091 3.0264 5.2567 4.6846 4.3167 4.5627 4.5000 4.0327 4.3218 4.9751 3.8854 2.9230 1.1963 3.0524 1.2043 2.7819 2.8738 1.0691 5.0916 1.0583 6.7329 2.0832 7.3402 1.7129 6.0148 3.8456 3.5444 2.1197 5.7562 3.0832 5.6086 1.3963 3.1227 1.4556 3.3796 1.3889 7.6478 2.0059 5.3274 1.3136 1.6090 2.0145 1.5531 1.5253 2.4319 2.5864 1.0986 1.5549 1.7556 2.4501 1.6895 4.9153 3.4288 1.2323 4.3387 3.3497 3.2270 1.4621 1.0676 1.9951 2.3762 4.1903 3.6007 2.5634 1.7134 3.0186 2.6134 2.5757 1.0384 1.0953 1.0992 1.0910 1.0868 1.0927 1.0964 1.0945 1.0752 1.0447 1.0440 1.1047 1.1058
irintensity: 0.3820 0.0766 0.7050 0.3884 0.3700 4.9359 11.8967 1.0837 0.4226 1.6261 9.7975 9.6151 184.7938 2.3388 289.0934 3.2849 1.3061 104.7434 2.6475 20.4877 2.3667 21.0148 6.1562 40.5600 2.1283 2.2776 9.6616 21.8681 1.9680 1.1101 0.3589 31.3728 127.3378 19.0595 1.3410 10.1173 0.6484 11.1387 5.7493 3.9212 1.3128 1.4312 20.2498 10.6390 1.1481 6.0781 0.9241 5.9182 78.0016 16.9635 37.3863 74.6807 3.5407 15.1494 24.0061 115.2135 16.2361 120.4198 22.1686 90.2924 263.6662 466.7553 806.6944 296.7982 545.0339 241.1373 296.0910 45.7662 44.9650 25.1706 12.6668 30.8224 9.5700 12.6331 27.8170 15.0636 15.0436 98.1081 86.0711 30.7036 41.0767
temp: 298.150 k
press: 1.00000 atm
elementType: 7 7 7 7 7 6 6 6 6 6 6 6 6 6 6 6 1 1 1 1 1 1 1 1 1 1 1 1 1
symmnumber: 1
zpe: 608652.9 jmol-1
zpe.correction: 0.231824 hartree
zpe.thermalcorrener: 0.246696 hartree
zpe.thermalcorrenthalpy: 0.247640 hartree
zpe.thermalcorrgfe: 0.188761 hartree
zpe.sumelectzpe: -699.623486 hartree
zpe.sumelectthermal: -699.608614 hartree
zpe.sumelectthermalent: -699.607670 hartree
zpe.sumelectthermalfe: -699.666548 hartree
dipole: 1.1135 -2.3204 0.0719
dipole: 2.5748
quadrupole: -77.9286 -70.1827 -102.1523
quadrupole: -2.5882 -0.2075 -0.0561
quadrupole: 5.4926 13.2385 -18.7311 -2.5882 -0.2075 -0.0561
hfenergy: -699.8553093 hartree
pointgroup: C01 [X(C11H13N5)]
dipole: 0.4315825 0.9164619 0.0008844 debye
polarizability: 274.4662397|9.5665724|177.1073461|-4.1439617|4.3402289|67.7291791 unknown
InChI: InChI=1S/C11H13N5/c1-7-3-2-4-8(5-7)14-10-6-9(12)15-11(13)16-10/h2-6,14H,12-13H2,1H3
charge 0 multiplicity 1
29 atoms
N  -0.245455 0.923554 0.00295
N  1.359053 -0.847029 -0.103847
N  3.758539 -0.324253 -0.133717
N  4.530801 1.872478 -0.062232
N  2.981419 -2.524406 -0.202624
C  -1.473516 0.213145 0.003181
C  -3.941961 0.400398 0.087726
C  -2.661067 0.995654 0.082389
C  1.081345 0.491483 -0.043645
C  -1.577415 -1.202173 -0.067438
C  -4.033318 -1.014059 0.020533
C  -2.857972 -1.793737 -0.057401
C  2.108833 1.478085 -0.024777
C  -5.194145 1.260705 0.139359
C  3.448296 1.012853 -0.07291
C  2.691194 -1.178394 -0.144597
H  -2.581919 2.091109 0.141013
H  -0.34804 1.939125 0.048855
H  -0.663888 -1.79398 -0.123711
H  -5.017895 -1.496105 0.030613
H  -2.936169 -2.886247 -0.107351
H  1.876996 2.546259 0.02554
H  -5.027216 2.191785 0.709905
H  -5.520133 1.551654 -0.878376
H  -6.033471 0.71911 0.60995
H  5.462045 1.464717 -0.09871
H  4.413839 2.880057 -0.022854
H  2.220033 -3.196158 -0.215649
H  3.953089 -2.817935 -0.236673
