program: Gaussian 09
title: 000241933
version: EM64L-G09RevD.01
frameworkgroup: C1[X(C11H14N6)]
method: RPBEPBE
basis: SDD
operation: Freq
keyword: #pfreq=noraman
keyword: PBEPBE/SDD
title: #p freq=noraman PBEPBE/SDD
converged: YES YES NO NO
title: Mulliken charges:
elementType: N N N N N N C C C C C C C C C C C H H H H H H H H H H H H H H
charge: -0.463267 -0.149833 -0.131792 -0.716895 -0.636799 -0.592737 0.454271 0.228419 0.493116 -0.487886 -0.082604 -0.488322 -0.467642 -0.188742 0.201314 -0.820721 -0.012750 0.337913 0.309250 0.220914 0.228345 0.217633 0.227810 0.229582 0.218784 0.300981 0.300797 0.325142 0.302309 0.320618 0.322792
chargesum: 0.00000
title: Mulliken charges with hydrogens summed into heavy atoms:
elementType: N N N N N N C C C C C C C C C C C
charge: -0.125354 -0.149833 -0.131792 -0.115117 -0.009349 0.050673 0.454271 0.228419 0.493116 -0.178635 -0.082604 -0.267409 -0.239297 0.028891 0.201314 -0.144546 -0.012750
polarizability: 2.73472884e+02 -1.75064759e-02 1.93160925e+02 2.16203525e-01 -1.86038812e-02 7.31253158e+01
1716.lowfreq: -8.3684 -7.0934 -0.0004 -0.0002 0.0003 0.2506 29.8002 38.7751 51.7126
frequency: 29.7868 38.6752 51.6895 82.2742 112.2002 185.4998 194.2719 207.1404 212.1114 254.4088 259.9588 289.6107 298.2120 310.2836 344.6852 369.5190 407.5695 419.9891 444.1898 465.1211 486.6393 513.9020 517.1378 522.1676 528.4476 563.1165 572.2210 614.1296 657.8783 697.9612 703.3492 715.1125 741.9408 763.3663 777.3841 780.9132 821.3181 878.1361 917.6283 938.1578 941.0754 965.3318 981.5539 997.6859 1027.3126 1049.4852 1095.3747 1116.4132 1118.6916 1120.3045 1180.2654 1188.1646 1221.0024 1272.9868 1302.4964 1328.4460 1380.8329 1392.2207 1406.9585 1419.3813 1451.0025 1468.3617 1470.4041 1477.1097 1483.7274 1522.2514 1549.2576 1575.7002 1594.4717 1599.9148 1613.4238 1622.3307 1626.0637 2974.3304 3053.2317 3081.2334 3110.2959 3126.5218 3150.9151 3170.8221 3407.6654 3466.5341 3557.0909 3568.4198 3582.5442 3713.0106 3729.0345
redmass: 2.9311 1.1691 4.5455 4.6322 4.3321 5.0472 4.6346 3.2061 4.5338 5.1309 2.7765 3.2617 2.5633 1.7533 3.2133 3.1372 1.1833 1.1794 2.8779 1.1269 5.8022 1.0449 4.9878 1.0726 4.5935 7.7692 3.5919 5.3402 6.6445 3.2189 2.9917 4.9831 6.2404 4.0195 7.7907 1.9074 1.2536 1.3520 2.7351 1.3419 2.2367 1.3374 4.5287 2.1054 2.3893 1.5678 1.8947 1.2989 2.1082 2.1309 1.0782 2.0860 4.0788 2.5987 1.4391 5.8592 5.6532 1.2562 3.5660 4.6788 2.3442 2.4493 1.0864 2.7397 1.3425 3.7007 4.1160 2.5299 1.5559 3.3406 1.9149 3.0726 1.4870 1.0369 1.0974 1.0989 1.0868 1.0903 1.0990 1.0927 1.0742 1.0429 1.0439 1.0439 1.1015 1.1048 1.1059
irintensity: 1.1271 0.0693 0.8946 0.3959 7.2101 5.6426 5.9462 0.2074 11.4565 0.6296 2.1055 15.7128 21.8863 68.7050 3.3397 1.0237 54.0854 420.4099 9.2657 167.0307 4.5852 0.0289 9.4244 28.0132 23.6147 0.2418 0.1073 0.7813 3.6478 12.7226 11.7559 1.7045 7.4630 22.3408 0.2054 2.6025 148.9377 6.9628 1.2150 18.8171 15.7515 0.2446 3.4288 4.7425 19.2106 17.9433 6.2034 2.4191 2.3136 8.2530 4.9643 12.0382 3.0315 16.4243 4.1966 24.8416 1.9461 22.2480 55.2153 55.4622 201.3166 197.2706 19.4736 43.4175 88.0133 206.8070 1253.5148 32.8801 532.8872 359.0330 106.2461 19.7702 185.8952 38.2900 23.3373 25.9339 8.6981 23.0105 35.3114 12.8225 79.7226 1.3034 85.0750 85.4631 8.9450 37.6550 40.7046
temp: 298.150 k
press: 1.00000 atm
elementType: 7 7 7 7 7 7 6 6 6 6 6 6 6 6 6 6 6 1 1 1 1 1 1 1 1 1 1 1 1 1 1
symmnumber: 1
zpe: 651604.4 jmol-1
zpe.correction: 0.248183 hartree
zpe.thermalcorrener: 0.264467 hartree
zpe.thermalcorrenthalpy: 0.265411 hartree
zpe.thermalcorrgfe: 0.204198 hartree
zpe.sumelectzpe: -754.893677 hartree
zpe.sumelectthermal: -754.877393 hartree
zpe.sumelectthermalent: -754.876449 hartree
zpe.sumelectthermalfe: -754.937663 hartree
dipole: -3.0642 -2.0013 -0.0056
dipole: 3.6598
quadrupole: -83.2832 -75.5887 -105.6817
quadrupole: 11.2479 0.1177 0.0739
quadrupole: 4.9013 12.5958 -17.4971 11.2479 0.1177 0.0739
hfenergy: -755.1418602 hartree
pointgroup: C01 [X(C11H14N6)]
dipole: 1.1605849 -0.8457257 0.1051184 debye
polarizability: 273.1151738|-5.0600175|190.5252893|-4.2056459|-18.3514409|76.118662 unknown
InChI: InChI=1S/C11H14N6/c1-6-3-2-4-7(5-6)15-10-8(12)9(13)16-11(14)17-10/h2-5,15H,12-14H2,1H3
charge 0 multiplicity 1
31 atoms
N  -0.237271 -1.099306 0.051244
N  0.936218 0.968601 -0.308619
N  3.393203 0.942883 -0.362221
N  2.085791 -2.561619 0.234643
N  4.597879 -1.039055 -0.066544
N  2.179627 2.914965 -0.656013
C  -1.594857 -0.708634 0.025009
C  0.939703 -0.382713 -0.091075
C  -3.410774 0.944328 -0.171403
C  -2.029197 0.630188 -0.160456
C  2.154709 -1.14259 0.003587
C  -2.564556 -1.738864 0.200999
C  -4.365036 -0.088099 0.00603
C  -3.935326 -1.423685 0.190659
C  3.368177 -0.412969 -0.141594
C  -3.853205 2.384404 -0.379079
C  2.171736 1.553908 -0.433259
H  -0.030873 -2.097274 0.203761
H  -1.27123 1.405238 -0.293602
H  -2.237563 -2.776768 0.345131
H  -5.435077 0.149539 -0.000162
H  -4.673915 -2.22188 0.327865
H  -3.379948 3.059564 0.358079
H  -3.566847 2.7492 -1.383975
H  -4.947769 2.489571 -0.28231
H  2.348277 -2.911713 1.159204
H  2.317583 -3.187143 -0.540735
H  5.433932 -0.471445 -0.178186
H  4.662734 -2.039419 0.094519
H  1.296187 3.411545 -0.717367
H  3.069989 3.393143 -0.75443
