program: Gaussian 09
title: 000226288
version: EM64L-G09RevD.01
frameworkgroup: C1[X(C7H9NO)]
method: RPBEPBE
basis: SDD
operation: Freq
keyword: #pfreq=noraman
keyword: PBEPBE/SDD
title: #p freq=noraman PBEPBE/SDD
converged: NO NO NO NO
title: Mulliken charges:
elementType: O N C C C C C C C H H H H H H H H H
charge: -0.283283 -0.384335 0.374326 0.466573 -0.461507 -0.454764 0.083694 -0.789847 -0.798828 0.237175 0.326994 0.250221 0.242441 0.242440 0.248868 0.233136 0.233562 0.233136
chargesum: 0.00000
title: Mulliken charges with hydrogens summed into heavy atoms:
elementType: O N C C C C C C C
charge: -0.283283 -0.057341 0.374326 0.466573 -0.224333 -0.204543 0.083694 -0.056099 -0.098994
polarizability: 1.03356790e+02 -1.96606691e+00 1.08492227e+02 -7.35514283e-04 -1.13870587e-02 4.59048835e+01
1716.lowfreq: -10.3832 0.0005 0.0006 0.0011 9.4195 15.6360 116.2942 122.6314 167.7386
frequency: 116.2375 122.6019 167.7326 191.9357 215.3354 265.2017 308.4550 486.6899 500.7969 515.6029 519.1248 585.0205 593.2197 698.0362 759.4279 827.2478 869.0868 902.2754 954.6799 972.9059 1021.7273 1040.1198 1047.4533 1051.9641 1154.0722 1221.3129 1241.7279 1308.2373 1391.6283 1403.7312 1407.5735 1428.7976 1465.0322 1466.2370 1467.6492 1481.6255 1549.9677 1617.2292 1660.5957 2976.3562 2977.7841 3053.3587 3053.7944 3096.2997 3107.2962 3162.1571 3166.3787 3501.0080
redmass: 1.0770 1.0965 4.4716 2.7976 2.9815 2.5420 3.9552 5.4206 3.7594 5.2492 3.2026 5.9121 2.9220 1.8467 1.7859 1.2662 1.4467 2.8331 3.9625 2.5289 1.5150 2.0234 1.5680 1.5160 1.7752 2.5165 2.3913 1.4580 1.3542 1.6480 1.5860 2.3190 1.1356 1.0457 1.0431 1.2902 6.0047 4.1891 6.8811 1.0377 1.0386 1.0971 1.0980 1.0988 1.0973 1.0923 1.0931 1.0771
irintensity: 0.2833 1.3278 0.2205 6.7688 0.4144 0.4685 3.6575 0.4951 2.6385 4.9660 0.1017 2.0965 1.8246 38.7937 51.9585 43.9291 12.9495 11.6627 6.1808 6.0778 0.5988 0.4693 15.6594 8.6076 3.1156 21.1634 8.5466 5.6069 18.6145 45.1299 0.8793 11.3613 9.8605 23.3830 7.7137 12.5722 20.8514 278.2267 365.0068 25.9362 23.7722 14.0937 19.5237 19.6121 12.6627 7.9760 0.9756 34.0625
temp: 298.150 k
press: 1.00000 atm
elementType: 8 7 6 6 6 6 6 6 6 1 1 1 1 1 1 1 1 1
symmnumber: 1
zpe: 383359.7 jmol-1
zpe.correction: 0.146014 hartree
zpe.thermalcorrener: 0.154776 hartree
zpe.thermalcorrenthalpy: 0.155720 hartree
zpe.thermalcorrgfe: 0.112614 hartree
zpe.sumelectzpe: -401.472035 hartree
zpe.sumelectthermal: -401.463273 hartree
zpe.sumelectthermalent: -401.462328 hartree
zpe.sumelectthermalfe: -401.505434 hartree
dipole: -0.7003 -5.3605 0.0011
dipole: 5.4061
quadrupole: -41.5258 -64.2810 -55.6370
quadrupole: 2.9292 -0.0011 0.0029
quadrupole: 12.2888 -10.4664 -1.8224 2.9292 -0.0011 0.0029
hfenergy: -401.6180486 hartree
pointgroup: C01 [X(C7H9N1O1)]
dipole: 0.2995774 2.1057145 0.0004364 debye
dipolederiv: -0.4865112 0.3347187 0.0000305 0.1441791 -1.4144024 0.0000173 0.0000895 -0.0005802 -0.3977951 -0.4208319 -0.4530695 -0.0001082 0.2311851 -0.7792757 -0.0001698 0.000066 -0.000009 -0.2743049 0.6647158 0.1483513 -0.0000062 -0.4373675 0.4044464 0.0000612 -0.0000566 0.0000386 0.0606399 0.6046843 0.0363145 0.0000404 0.0407637 0.6241548 0.0000323 0.0000375 0.0001357 0.0204983 -0.7406772 -0.2658642 -0.0000188 0.0217646 -0.1631852 0.0000342 0.0000239 -0.0000354 -0.272299 -0.2539226 0.561015 0.0001057 0.1219944 -0.5694929 -0.000024 -0.0000279 -0.000009 -0.2012871 0.5584461 -0.3118141 -0.0000057 -0.1334299 1.7446304 0.0001469 -0.0000871 0.0004706 0.1889189 -0.1065945 -0.1193073 -0.0000058 -0.0182951 -0.0153565 -0.0000129 -0.0000357 0.0000076 0.0709951 -0.1457232 0.0804653 -0.0000077 0.1570667 -0.0155084 -0.0000081 0.0000375 0.0000188 0.0594169 0.0876125 0.0067183 -0.0000068 0.0013397 -0.082105 -0.000036 -0.0000082 -0.0000262 0.1731376 0.1663528 -0.0116798 0.0000114 0.0097933 0.1674382 -0.0000091 0.0000403 -0.0000021 0.3058722 -0.0160828 -0.0542594 -0.0000351 -0.0693475 0.0362792 -0.0000193 -0.0000435 -0.000012 0.1672395 -0.0210179 -0.0267281 0.0841172 0.0074953 0.0741933 -0.0652003 0.1312396 -0.019133 -0.0299215 -0.0210548 -0.0267044 -0.0841325 0.007516 0.0741679 0.0652233 -0.1312417 0.0191601 -0.029879 0.0758089 0.0997524 0.0000144 -0.0027079 -0.1003918 -0.00003 -0.0000023 -0.0000328 0.1206808 0.0464981 0.0278721 -0.0040806 0.0388209 0.0206592 -0.1141601 0.0516754 -0.1241141 -0.0363748 -0.038215 -0.0536496 -0.0000132 -0.1595938 -0.0268425 -0.0000241 -0.0000324 -0.0000213 0.1108089 0.0465126 0.0278688 0.004101 0.0388231 0.0205909 0.1141785 -0.0516746 0.1241435 -0.0363467 unknown
polarizability: 103.312554|-1.9069057|108.5364633|0.0008655|0.0113779|45.9048835 unknown
InChI: InChI=1S/C7H9NO/c1-5-3-6(2)8-7(9)4-5/h3-4,8H,1-2H3
charge 0 multiplicity 1
18 atoms
O  0.505034 -2.706857 -0.000616
N  1.263428 -0.494881 0.000034
C  1.08983 0.883641 0.000209
C  -1.33688 0.491844 0.000095
C  -0.203028 1.389437 0.000317
C  -1.121163 -0.882445 -0.0001
C  0.212595 -1.466595 0.000126
C  2.343278 1.72741 0.00026
C  -2.735671 1.075956 0.000031
H  -0.353735 2.472503 0.000454
H  2.209372 -0.891652 -0.000113
H  -1.950539 -1.596209 -0.000338
H  2.964579 1.52492 -0.89311
H  2.964676 1.524689 0.893507
H  2.087487 2.798636 0.000409
H  -2.896009 1.714847 0.889434
H  -3.506105 0.287449 -0.000114
H  -2.895847 1.715008 -0.889282
