program: Gaussian 09
title: 000226281
version: EM64L-G09RevD.01
frameworkgroup: C1[X(C13H14N2O)]
method: RPBEPBE
basis: SDD
operation: Freq
keyword: #p
keyword: freq=noraman
keyword: PBEPBE/SDD
title: #p freq=noraman PBEPBE/SDD
converged: YES YES NO NO
title: Mulliken charges:
elementType: O N N C C C C C C C C C C C C C H H H H H H H H H H H H H H
charge: -0.333523 -0.385514 -0.402107 -0.168422 0.400153 -0.757033 -0.429583 0.192813 -0.247682 -0.290010 0.271011 -0.349436 -0.349111 -0.220911 -0.238198 -0.225784 0.259659 0.310360 0.215540 0.229160 0.246141 0.360486 0.240313 0.247920 0.237869 0.275209 0.213047 0.233252 0.230813 0.233569
chargesum: 0.00000
title: Mulliken charges with hydrogens summed into heavy atoms:
elementType: O N N C C C C C C C C C C C C C
charge: -0.333523 -0.075154 -0.041620 0.091237 0.400153 -0.066192 -0.189271 0.192813 0.000239 -0.052142 0.271011 -0.074228 -0.136064 0.012340 -0.007385 0.007785
polarizability: 2.07297816e+02 5.59249349e+00 1.36895848e+02 4.96061634e+00 1.76530268e+01 1.14444692e+02
1716.lowfreq: -7.1455 0.0005 0.0006 0.0008 7.1547 9.6206 30.0128 35.7801 73.3303
frequency: 29.9888 35.6817 73.3188 103.9257 114.7252 133.1341 189.2212 204.2559 236.3128 257.9055 283.4422 321.1544 396.0052 403.9904 459.9625 462.4260 501.0265 525.5891 611.3108 614.4964 620.3619 665.6675 683.7180 700.6827 719.5486 719.7392 766.3075 793.0112 822.3657 842.2569 853.4136 865.2261 877.4599 886.0439 933.6316 939.1545 983.3188 989.6817 1005.4085 1021.3615 1027.1729 1035.2811 1078.8216 1083.6945 1096.3946 1112.3462 1139.6683 1143.3697 1173.8571 1191.7768 1238.2422 1257.6986 1266.3606 1315.7871 1327.3923 1344.7697 1384.6283 1391.7448 1409.0648 1414.5958 1432.2628 1460.2946 1465.0353 1474.8718 1483.5405 1494.0409 1546.8361 1570.9265 1599.7989 1611.1775 2983.5541 2989.8610 3081.2526 3106.0627 3118.2294 3132.6607 3146.0601 3159.7106 3170.7646 3201.2941 3216.5246 3240.4545 3445.3574 3550.2708
redmass: 4.0810 5.0529 4.2718 3.6328 6.1760 4.2568 4.1463 3.5491 1.2227 3.9726 3.8630 3.9077 3.4505 3.6464 3.3810 4.0420 1.7775 2.2421 3.2164 6.2996 3.8488 5.6982 4.5821 1.6167 1.3870 2.0819 1.3966 2.4251 1.3280 3.8615 1.2701 1.3203 4.2968 2.3892 1.5001 2.4114 1.4163 5.4863 1.3434 1.8326 1.9505 1.3432 1.8777 1.5961 2.2651 2.3709 2.8232 1.4715 1.0592 1.1296 1.8791 1.7182 1.7117 1.3467 1.8665 1.4379 8.8305 1.2397 2.9349 3.6961 2.2602 2.2662 3.0281 1.0708 1.1008 2.4309 5.5498 4.2154 6.1690 6.0436 1.0779 1.0422 1.0994 1.0990 1.0873 1.0869 1.0921 1.0958 1.1005 1.0909 1.0968 1.1076 1.0845 1.0776
irintensity: 0.2796 1.0663 1.7712 1.7276 12.1826 3.0579 1.0076 3.9671 2.0449 3.5544 13.1379 2.5433 1.0725 0.2221 12.3255 2.7543 36.0432 52.8848 5.6612 0.1032 6.7184 3.8529 8.2735 72.0013 93.9186 27.5036 56.9786 16.8244 119.3187 12.5643 1.3530 3.1875 2.4720 3.4607 1.4273 3.9821 1.8679 0.6910 1.6487 1.2447 14.2819 30.5200 27.4838 18.8243 11.2512 18.8165 58.7737 18.1973 0.7896 7.6898 29.5895 13.3372 42.2838 2.0448 84.2214 44.5156 2.8317 37.6001 57.4894 14.2821 6.5509 137.4882 61.3909 10.4728 2.3780 125.1179 98.5690 22.1788 18.4812 4.9922 14.3417 17.8142 33.5179 23.0672 11.4093 1.4396 22.0926 16.0642 20.3095 6.5817 6.9347 4.2243 255.8534 14.9727
temp: 298.150 k
press: 1.00000 atm
elementType: 8 7 7 6 6 6 6 6 6 6 6 6 6 6 6 6 1 1 1 1 1 1 1 1 1 1 1 1 1 1
symmnumber: 1
zpe: 638565.1 jmol-1
zpe.correction: 0.243217 hartree
zpe.thermalcorrener: 0.257402 hartree
zpe.thermalcorrenthalpy: 0.258346 hartree
zpe.thermalcorrgfe: 0.200947 hartree
zpe.sumelectzpe: -687.380131 hartree
zpe.sumelectthermal: -687.365945 hartree
zpe.sumelectthermalent: -687.365001 hartree
zpe.sumelectthermalfe: -687.422400 hartree
dipole: -2.5800 2.7274 0.9051
dipole: 3.8619
quadrupole: -88.1229 -86.8574 -95.4386
quadrupole: 2.7482 -2.6575 2.2148
quadrupole: 2.0167 3.2823 -5.2990 2.7482 -2.6575 2.2148
hfenergy: -687.6233472 hartree
pointgroup: C01 [X(C13H14N2O1)]
dipole: -1.0493697 -0.2113273 1.0782902 debye
polarizability: 206.2909917|6.1769612|108.2527333|10.4089114|-10.3581024|144.0946302 unknown
InChI: InChI=1S/C13H14N2O/c1-10(12-8-5-9-14-12)15-13(16)11-6-3-2-4-7-11/h2-10,14-15H,1H3
charge 0 multiplicity 1
30 atoms
O  -0.120475 1.078079 -1.397438
N  0.215464 0.547716 0.835107
N  2.566117 0.152743 -1.203495
C  1.577582 1.168517 0.88528
C  2.620845 0.326171 0.183356
C  1.940179 1.447511 2.354405
C  3.74667 -0.374742 0.649985
C  -0.549888 0.552728 -0.308902
C  3.621977 -0.648635 -1.622052
C  4.378192 -0.987723 -0.489287
C  -1.921577 -0.064598 -0.228147
C  -2.868091 0.31591 -1.213387
C  -2.291789 -1.016396 0.758742
C  -4.170842 -0.223572 -1.197846
C  -3.593972 -1.562022 0.768851
C  -4.539051 -1.161429 -0.204195
H  1.480697 2.131469 0.343896
H  -0.15035 0.13549 1.694904
H  2.038081 0.507968 2.929754
H  1.170817 2.0788 2.833213
H  2.905234 1.977116 2.409131
H  1.786427 0.527929 -1.759162
H  4.085157 -0.428791 1.684061
H  3.759276 -0.913254 -2.668427
H  5.279663 -1.598706 -0.484816
H  -2.553659 1.029955 -1.98128
H  -1.564857 -1.372766 1.499284
H  -4.896969 0.081846 -1.958995
H  -3.867762 -2.304422 1.526352
H  -5.549596 -1.584593 -0.193891
