program: Gaussian 09
title: 000241945
version: EM64L-G09RevD.01
frameworkgroup: C1[X(C22H21NO)]
method: RPBEPBE
basis: SDD
operation: Freq
keyword: #p
keyword: freq=noraman
keyword: PBEPBE/SDD
title: #p freq=noraman PBEPBE/SDD
converged: YES YES NO NO
title: Mulliken charges:
elementType: O N C C C C C C C C C C C C C C C C C C C C C C H H H H H H H H H H H H H H H H H H H H H
charge: -0.256581 -0.443589 -0.500431 0.488931 0.445216 0.432640 -0.560534 -0.456352 0.272874 0.306008 -0.366587 -0.418803 -0.410485 -0.385724 -0.379172 -0.858282 -0.236001 -0.235912 -0.242357 -0.241826 -0.246114 -0.244647 0.210174 -0.805635 0.220444 0.257913 0.237751 0.307129 0.237162 0.235784 0.256883 0.253588 0.224725 0.227225 0.253214 0.224200 0.224172 0.224317 0.223691 0.331795 0.226722 0.226656 0.235449 0.269252 0.235118
chargesum: 0.00000
title: Mulliken charges with hydrogens summed into heavy atoms:
elementType: O N C C C C C C C C C C C C C C C C C C C C C C
charge: -0.256581 -0.111794 -0.279987 0.488931 0.445216 0.432640 -0.302621 -0.218601 0.272874 0.306008 -0.059459 -0.181641 -0.174701 -0.128840 -0.125584 -0.153119 -0.011802 -0.011740 -0.018040 -0.018135 -0.019392 -0.017991 0.210174 -0.065816
polarizability: 3.10070779e+02 -3.23254803e+00 2.42300120e+02 -4.01359948e-01 -4.29330603e+00 1.96920007e+02
1716.lowfreq: -90.1195 -0.0006 -0.0004 -0.0001 2.7800 5.2617 9.7917 21.2248 26.5505
frequency: -90.1185 20.8473 26.4756 34.6320 41.0181 56.0052 60.5221 63.6656 89.1973 128.9078 170.9581 190.6421 198.4531 215.5974 224.8297 230.8919 260.8378 282.0236 287.3498 355.5093 371.9859 402.2317 404.4733 438.7447 448.0453 476.0093 489.2372 529.1527 545.8125 562.3931 583.7837 613.0974 616.5765 619.7967 630.4855 639.0169 672.5009 704.4104 705.7219 719.8137 749.2975 755.2886 784.4437 808.0968 829.4702 847.2068 855.1141 857.8618 872.6300 913.8440 916.3739 928.2333 933.4024 955.3001 978.6282 980.3407 984.8119 989.0005 990.4472 990.9752 994.4108 995.6521 997.8184 1027.0955 1028.4277 1028.9509 1043.7462 1081.1384 1084.6975 1121.6179 1153.6312 1171.1435 1171.4899 1184.4086 1189.6752 1190.9655 1201.9870 1216.6539 1221.9899 1263.2070 1266.8024 1292.4966 1300.3978 1326.3423 1335.8988 1369.5787 1373.9475 1381.5202 1385.6230 1397.2171 1417.7820 1436.7411 1441.2177 1441.8653 1463.2957 1467.9928 1481.5850 1482.5138 1483.6131 1499.2553 1510.6742 1590.1898 1593.4263 1594.2182 1610.0798 1613.3357 1624.3165 1634.6286 2953.4513 2972.0565 2986.5232 3021.0111 3071.3258 3089.0857 3113.5799 3114.3288 3122.8995 3123.5732 3124.3716 3130.5771 3135.6406 3136.3328 3136.7158 3145.7198 3147.0007 3161.6175 3162.0940 3191.6436 3534.6079
redmass: 1.0436 4.9891 3.7116 4.3240 3.8729 4.7923 4.5471 5.1397 4.3170 5.1321 3.0971 1.5447 3.6026 3.6021 2.2963 4.2614 3.8914 5.4012 4.7430 4.0475 4.5878 2.8179 2.8315 3.6331 3.0656 3.5996 3.6257 4.4424 3.8880 4.1338 3.3201 4.2672 6.1630 3.2854 3.4993 1.6523 5.3240 1.8297 2.0269 2.3620 3.2743 2.1123 2.7153 3.4195 3.1253 2.6735 1.2530 1.2510 1.7449 1.4641 2.1284 2.0388 1.7998 3.3598 1.3932 1.4058 1.5822 1.3421 5.0164 5.5604 1.4238 1.3871 1.5277 2.2834 1.6653 2.1648 1.5232 1.6122 1.5943 2.0844 1.9792 1.0529 1.0520 2.3000 1.1138 1.1210 2.3295 1.7412 2.8380 1.3767 1.5819 3.3148 1.5718 1.3904 1.2734 4.3617 1.3172 5.8107 6.8593 1.2685 3.1380 2.1042 1.9959 1.4171 1.2920 1.0472 2.2488 2.2466 1.0475 1.5568 2.2009 6.0071 5.9767 5.7006 5.9976 6.0640 5.8763 4.9320 1.0400 1.0823 1.0384 1.0977 1.0984 1.0946 1.0869 1.0867 1.0862 1.0863 1.0907 1.0911 1.0915 1.0916 1.0977 1.0957 1.0953 1.1014 1.1014 1.0941 1.0758
irintensity: 0.0127 1.6276 0.0493 1.7165 0.1479 0.2779 7.1797 1.2336 0.2027 4.8556 0.1270 1.9311 0.6106 1.7576 0.9000 0.0076 0.9507 1.2216 2.2723 1.4631 1.9470 0.2531 0.2128 1.7167 5.9633 5.3431 15.8388 1.4567 5.0012 0.9837 0.9804 14.0742 0.6504 28.5191 31.2505 21.5750 3.3627 46.8976 35.9629 45.4026 16.4883 38.2100 9.1639 5.5470 14.0979 11.2691 0.0743 0.1422 17.5077 5.7698 5.8994 3.0198 2.2984 8.3316 0.0618 0.0711 12.5817 2.8547 2.1415 1.3637 2.9400 3.9505 7.7674 8.3266 6.1948 15.5472 4.9122 2.2218 14.1820 6.4791 6.6582 0.0427 0.0360 1.9768 2.1035 3.0492 0.0095 9.8872 52.5132 1.6176 0.9840 51.9656 72.5152 12.0911 0.8186 44.7929 64.4191 42.5611 1.3990 26.9796 38.7700 31.3596 8.5623 104.2607 16.9221 18.4909 17.4699 28.2161 15.6229 38.1332 377.2427 5.4431 14.4327 53.2526 18.3430 8.7368 4.4452 137.2882 40.1754 12.8736 10.3267 21.1217 15.9272 14.0084 7.1217 6.6939 0.1100 0.4339 13.4842 5.2902 14.5686 19.1221 7.9576 32.2442 36.1925 38.9838 21.4798 6.4011 19.3555
temp: 298.150 k
press: 1.00000 atm
elementType: 8 7 6 6 6 6 6 6 6 6 6 6 6 6 6 6 6 6 6 6 6 6 6 6 1 1 1 1 1 1 1 1 1 1 1 1 1 1 1 1 1 1 1 1 1
symmnumber: 1
zpe: 961748.8 jmol-1
zpe.correction: 0.366311 hartree
zpe.thermalcorrener: 0.387263 hartree
zpe.thermalcorrenthalpy: 0.388207 hartree
zpe.thermalcorrgfe: 0.313891 hartree
zpe.sumelectzpe: -979.260071 hartree
zpe.sumelectthermal: -979.239119 hartree
zpe.sumelectthermalent: -979.238175 hartree
zpe.sumelectthermalfe: -979.312491 hartree
dipole: -0.2263 -2.6775 3.2007
dipole: 4.1791
quadrupole: -131.8836 -136.2049 -135.0941
quadrupole: 13.3968 -16.9191 1.8045
quadrupole: 2.5106 -1.8107 -0.6999 13.3968 -16.9191 1.8045
hfenergy: -979.6263819 hartree
pointgroup: C01 [X(C22H21N1O1)]
dipole: -0.047392 -1.0380117 1.2742169 debye
polarizability: 310.1637904|-1.6386338|242.0570797|-1.685112|-4.8967256|197.0700353 unknown
InChI: InChI=1S/C22H21NO/c1-16-15-20(13-14-21(16)23-17(2)24)22(18-9-5-3-6-10-18)19-11-7-4-8-12-19/h3-15,22-23H,1-2H3
charge 0 multiplicity 1
45 atoms
O  -5.389834 0.986249 -1.172532
N  -4.321782 -0.38644 0.413045
C  1.330384 0.143299 -0.858592
C  -0.162185 -0.033119 -0.531935
C  2.166794 -1.091302 -0.475326
C  1.912469 1.451118 -0.290253
C  -0.618247 -0.843355 0.535143
C  -1.130748 0.664473 -1.29363
C  -1.989127 -0.968397 0.855478
C  -2.943621 -0.247871 0.071259
C  -2.505408 0.566189 -1.00649
C  2.143005 -2.230279 -1.321852
C  3.057909 2.020888 -0.905554
C  2.937697 -1.147881 0.712001
C  1.363095 2.097781 0.843803
C  -2.426241 -1.856063 2.010731
C  2.869533 -3.395111 -0.993612
C  3.639798 3.204411 -0.402717
C  3.665748 -2.313727 1.0458
C  1.943705 3.2831 1.35197
C  3.635133 -3.441993 0.195703
C  3.084016 3.841389 0.732244
C  -5.442358 0.201512 -0.180858
C  -6.763144 -0.190476 0.487289
H  1.396549 0.23076 -1.963438
H  0.110919 -1.406722 1.128688
H  -0.806532 1.303623 -2.124213
H  -3.247264 1.104861 -1.598199
H  1.545042 -2.202303 -2.241658
H  3.497076 1.527747 -1.782136
H  2.981155 -0.272504 1.369616
H  0.468792 1.683019 1.32155
H  -2.957732 -1.286838 2.800653
H  -3.093036 -2.677977 1.679154
H  -1.551929 -2.327036 2.488479
H  2.842274 -4.26245 -1.663164
H  4.521052 3.631279 -0.895087
H  4.26039 -2.33738 1.966344
H  1.501664 3.772071 2.227715
H  -4.515319 -0.999398 1.20765
H  4.203552 -4.34329 0.451622
H  3.531191 4.762491 1.122711
H  -6.93207 -1.282338 0.437509
H  -7.583709 0.317476 -0.038884
H  -6.782355 0.112609 1.550773
