program: Gaussian 09
title: 000226278
version: EM64L-G09RevD.01
frameworkgroup: C1[X(C7H15NO4)]
method: RPBEPBE
basis: SDD
operation: Freq
keyword: #p
keyword: freq=noraman
keyword: PBEPBE/SDD
title: #p freq=noraman PBEPBE/SDD
converged: YES YES NO NO
title: Mulliken charges:
elementType: O O O O N C C C C C C C H H H H H H H H H H H H H H H
charge: -0.281596 -0.260296 -0.418319 -0.217847 -0.571471 0.059965 -0.244063 -0.203768 -0.219026 0.176731 -0.680329 -0.679262 0.200777 0.250181 0.227113 0.183861 0.211699 0.186343 0.308128 0.271534 0.204006 0.223433 0.236817 0.203723 0.223032 0.234494 0.374140
chargesum: 0.00000
title: Mulliken charges with hydrogens summed into heavy atoms:
elementType: O O O O N C C C C C C C
charge: -0.281596 -0.260296 -0.044179 -0.217847 0.008191 0.260742 0.006118 0.207206 0.179016 0.176731 -0.016072 -0.018014
polarizability: 1.12519826e+02 -4.74940649e+00 9.74505212e+01 -1.09374009e+00 -4.00891142e-01 8.61791498e+01
1716.lowfreq: -14.4113 -9.8837 -8.4329 -0.0007 -0.0005 0.0003 30.4218 45.2451 55.7762
frequency: 30.3229 45.0752 55.7353 65.4228 71.5259 79.9924 130.9461 172.9675 192.2260 238.0873 246.5045 255.2894 257.7236 291.8139 317.1304 346.8329 411.7603 462.9573 523.9344 550.6350 601.0345 627.6703 697.5106 748.1816 759.6136 810.0244 818.8149 855.0009 889.2414 969.8721 988.8640 1023.2980 1034.9625 1042.4924 1073.7308 1111.0223 1117.8537 1134.3017 1137.5066 1147.3708 1198.0388 1235.7097 1245.9716 1263.0491 1269.8880 1300.7429 1332.0914 1366.7284 1371.8121 1381.3384 1393.3583 1397.3517 1459.1315 1460.1370 1477.0281 1480.0017 1488.5983 1491.8543 1634.0384 1669.3258 2888.0455 2931.4749 2945.7207 2993.5669 2994.4866 2998.0928 3038.1645 3041.3545 3090.8184 3091.9401 3102.0453 3103.5756 3457.2171 3505.9628 3584.1984
redmass: 4.3346 2.1704 3.2706 2.5335 4.1309 2.7121 3.5388 3.5975 2.3020 1.4439 1.3371 4.4164 2.7523 2.3320 2.2956 1.9447 4.0224 3.3128 4.3492 4.0170 1.7584 2.4289 1.6053 4.2892 3.3786 1.0924 1.0970 2.8126 2.8621 5.0358 3.9752 3.1274 2.2313 3.5297 3.4033 1.9948 2.1920 1.5924 1.4706 2.1663 1.9929 1.4467 1.1559 1.1453 1.4267 1.2285 1.3566 1.3901 1.3056 1.2732 1.2732 1.3313 1.0408 1.0409 1.0545 1.0497 1.0743 1.0814 1.0909 8.6959 1.0827 1.0599 1.0645 1.0358 1.0361 1.1013 1.0976 1.0845 1.0990 1.0989 1.1010 1.1013 1.0450 1.0640 1.0974
irintensity: 0.3965 0.0421 0.2484 0.4724 3.4502 5.4245 2.8050 3.6870 3.2421 2.5344 3.6657 6.6009 0.9823 28.5298 30.9513 22.6419 12.0979 18.4074 13.4957 6.4937 112.5525 50.0155 243.5551 13.5144 10.8794 4.2953 2.8685 6.5900 3.5059 99.7054 29.5005 151.8069 39.2235 299.7630 130.7684 2.9521 22.0551 20.3348 8.6137 30.2331 7.8360 11.6980 5.0547 3.4037 42.0185 31.9557 9.5959 9.3877 2.8608 6.2170 16.9230 21.4283 10.8995 10.8512 3.1928 7.3749 6.7135 4.3946 45.3900 228.0626 58.2728 63.4621 64.1895 28.3926 22.3933 38.1617 20.5692 17.6186 35.3650 36.1856 35.5036 37.9758 5.9895 12.6567 7.7476
temp: 298.150 k
press: 1.00000 atm
elementType: 8 8 8 8 7 6 6 6 6 6 6 6 1 1 1 1 1 1 1 1 1 1 1 1 1 1 1
symmnumber: 1
zpe: 586278.5 jmol-1
zpe.correction: 0.223302 hartree
zpe.thermalcorrener: 0.238351 hartree
zpe.thermalcorrenthalpy: 0.239295 hartree
zpe.thermalcorrgfe: 0.179749 hartree
zpe.sumelectzpe: -630.374162 hartree
zpe.sumelectthermal: -630.359113 hartree
zpe.sumelectthermalent: -630.358169 hartree
zpe.sumelectthermalfe: -630.417714 hartree
dipole: 1.5920 -1.5437 1.3929
dipole: 2.6187
quadrupole: -65.7068 -69.1279 -72.8048
quadrupole: 4.9076 -1.6755 1.2963
quadrupole: 3.5064 0.0853 -3.5916 4.9076 -1.6755 1.2963
hfenergy: -630.5974636 hartree
pointgroup: C01 [X(C7H15N1O4)]
dipole: 0.4903943 0.7522121 -0.5051185 debye
polarizability: 109.7799184|7.3964528|100.1159202|1.9080693|0.6208235|86.2536586 unknown
InChI: InChI=1S/C7H15NO4/c1-3-11-7(12-4-2)5(8)6(9)10/h5,7,9H,3-4,8H2,1-2H3
charge 0 multiplicity 1
27 atoms
O  -1.400646 -0.008998 -0.049822
O  0.563694 1.245357 0.15591
O  2.204129 -1.220658 0.838488
O  0.335481 -2.593786 1.000065
N  -0.296307 -1.867555 -1.787721
C  -0.165894 0.312896 -0.699174
C  0.56631 -1.043156 -0.943935
C  -2.344477 1.12775 0.052708
C  1.720395 1.884272 -0.500125
C  0.964045 -1.705485 0.390455
C  -3.644635 0.579855 0.636336
C  2.20479 3.001619 0.422953
H  -0.341326 0.7830 -1.698949
H  1.503832 -0.813025 -1.480938
H  -1.897394 1.904314 0.700567
H  -2.501867 1.55694 -0.961274
H  2.521461 1.132695 -0.654267
H  1.413063 2.286361 -1.491646
H  -1.199386 -2.051699 -1.336436
H  0.148697 -2.722538 -2.134495
H  -4.384432 1.392989 0.751816
H  -4.074436 -0.195467 -0.021178
H  -3.460013 0.130232 1.626865
H  3.091477 3.500789 -0.008955
H  1.413779 3.75649 0.573764
H  2.480725 2.587558 1.407766
H  2.418734 -1.630151 1.72062
