program: Gaussian 09
title: 000241923
version: EM64L-G09RevD.01
frameworkgroup: C1[X(C15H13N3O2)]
method: RPBEPBE
basis: SDD
operation: Freq
keyword: #p
keyword: freq=noraman
keyword: PBEPBE/SDD
title: #p freq=noraman PBEPBE/SDD
converged: NO YES NO NO
title: Mulliken charges:
elementType: O O N N N C C C C C C C C C C C C C C C H H H H H H H H H H H H H
charge: -0.208922 -0.211540 -0.157127 -0.094077 0.024486 -0.404441 -0.428407 0.021834 0.312560 -0.343917 -0.310908 0.232536 -0.364071 -0.381832 0.386953 -0.390452 -0.337476 -0.203616 -0.227086 -0.252501 0.253139 0.263288 0.250385 0.248050 0.287297 0.256281 0.287148 0.286312 0.250933 0.269744 0.228161 0.227306 0.229959
chargesum: 0.00000
title: Mulliken charges with hydrogens summed into heavy atoms:
elementType: O O N N N C C C C C C C C C C C C C C C
charge: -0.208922 -0.211540 -0.157127 -0.094077 0.024486 0.111987 0.070029 0.021834 0.312560 -0.056620 -0.054627 0.232536 -0.076923 -0.095519 0.386953 -0.139519 -0.067731 0.024544 0.000220 -0.022542
polarizability: 4.09891586e+02 1.98140834e+01 1.88628336e+02 -5.37469035e+00 2.46364619e+01 1.05267325e+02
1716.lowfreq: -6.4711 -1.1480 -0.0008 -0.0005 -0.0005 3.8092 33.1655 38.4203 45.4295
frequency: 33.0924 38.4002 45.4179 67.2092 85.1754 89.5279 124.9029 132.2454 179.8831 182.9900 210.3010 260.2279 270.7299 308.0276 355.6417 400.0864 409.2561 411.6244 461.0561 472.2795 507.8466 522.3388 574.5301 606.7069 621.4193 650.5077 659.7576 679.5351 685.3236 695.6977 754.1535 767.0380 783.2836 803.2961 814.6201 841.0720 852.1891 858.5916 881.6124 896.8337 913.3906 970.4314 983.2878 988.2976 991.8622 998.3370 1003.0311 1009.0567 1021.0178 1041.6405 1078.2300 1091.1382 1093.4666 1107.1804 1109.4236 1120.4794 1141.2423 1167.4107 1172.0606 1176.9494 1191.1633 1218.6848 1266.9763 1293.0725 1308.9122 1345.7509 1360.4452 1370.1148 1401.8349 1414.9439 1438.6391 1460.2719 1467.5629 1476.2257 1480.8985 1564.1564 1573.7255 1588.8839 1607.2098 1609.2956 3074.5014 3085.7077 3125.0529 3133.7516 3149.9114 3156.7677 3168.3768 3168.6921 3168.8682 3179.3744 3185.6936 3189.0238 3196.9986
redmass: 6.4486 5.9235 4.8593 5.8865 4.6313 4.8308 2.9156 4.6392 5.1374 4.6913 6.5632 5.2309 5.8688 4.9132 5.6451 5.4564 2.9824 2.9435 4.9349 4.6657 6.9298 3.4400 7.1413 6.3426 6.9341 6.4514 6.3345 5.0149 6.3696 1.8790 4.5281 1.9088 8.1408 1.0629 5.6043 1.2794 1.5686 2.6535 1.6959 4.1348 1.5438 1.3626 5.1931 1.3336 1.3466 1.4397 1.9120 1.5052 2.1495 2.4444 1.5475 1.3337 2.9960 1.3110 1.3185 1.5947 1.4214 1.2230 1.3280 1.3015 1.8646 5.8516 3.6482 1.2860 1.4303 4.8072 7.7197 5.7118 9.6258 4.2688 2.4599 1.0780 2.2247 1.2936 2.2643 8.1579 6.4991 7.7233 6.5040 6.8266 1.0502 1.0587 1.0849 1.0881 1.0925 1.0961 1.0884 1.0891 1.1011 1.1186 1.0960 1.0972 1.1177
irintensity: 0.1974 0.3637 0.4880 0.0814 0.4170 2.5526 1.5311 4.4328 2.4408 1.4733 8.2304 9.9172 1.4954 0.3296 4.7266 8.1892 3.2122 1.2608 1.2202 5.3122 0.2796 19.1920 1.9297 1.4095 1.7935 14.8198 6.3816 29.4653 9.9002 42.4493 3.2921 60.5579 23.1979 17.6624 20.9595 2.2257 4.2984 1.3109 64.3126 6.2987 3.5658 0.7255 0.1199 0.4575 2.8319 14.2191 3.8508 0.1553 6.4233 59.9851 13.2773 4.5532 21.7172 11.3236 22.5853 27.4657 0.7664 1.7050 2.1959 56.4468 41.2594 583.0613 4.4504 1.0988 1.9000 195.4003 66.1104 2.2729 24.3320 44.6683 4.1194 2.4818 21.2691 24.5057 10.8621 122.3990 32.3831 9.4571 24.2779 109.7455 23.9662 16.5094 5.7894 7.8983 15.8199 23.8524 4.0540 0.2515 31.2903 1.7813 0.3936 1.8214 15.9786
temp: 298.150 k
press: 1.00000 atm
elementType: 8 8 7 7 7 6 6 6 6 6 6 6 6 6 6 6 6 6 6 6 1 1 1 1 1 1 1 1 1 1 1 1 1
symmnumber: 1
zpe: 655516.8 jmol-1
zpe.correction: 0.249673 hartree
zpe.thermalcorrener: 0.266602 hartree
zpe.thermalcorrenthalpy: 0.267547 hartree
zpe.thermalcorrgfe: 0.203240 hartree
zpe.sumelectzpe: -892.555698 hartree
zpe.sumelectthermal: -892.538769 hartree
zpe.sumelectthermalent: -892.537825 hartree
zpe.sumelectthermalfe: -892.602132 hartree
dipole: -6.1709 3.5489 -1.6541
dipole: 7.3082
quadrupole: -145.5688 -105.9914 -114.3255
quadrupole: 3.5877 -0.2669 2.3963
quadrupole: -23.6070 15.9705 7.6364 3.5877 -0.2669 2.3963
hfenergy: -892.8053714 hartree
pointgroup: C01 [X(C15H13N3O2)]
dipole: -2.3541278 1.2995162 1.0181405 debye
polarizability: 410.5997207|-3.7113637|100.4387664|15.2449271|14.2359912|192.7487601 unknown
InChI: InChI=1S/C15H13N3O2/c19-18(20)14-8-6-12(7-9-14)15(17-10-11-17)16-13-4-2-1-3-5-13/h1-9H,10-11H2
charge 0 multiplicity 1
33 atoms
O  5.572536 -0.78614 -1.789071
O  5.957586 -0.568109 0.448851
N  -0.867719 0.819227 1.543123
N  -1.30035 -0.070098 -0.683256
N  5.171613 -0.584992 -0.577345
C  -1.889482 1.886157 1.736646
C  -0.426407 2.1378 2.100898
C  -0.484558 0.29784 0.281729
C  0.982277 0.081718 0.080398
C  1.475981 -0.150459 -1.232963
C  1.890361 0.074049 1.175487
C  -2.710371 -0.128616 -0.631323
C  2.845259 -0.366681 -1.458055
C  3.26332 -0.149196 0.966373
C  3.725615 -0.359435 -0.351188
C  -3.418698 0.14297 -1.838392
C  -3.44626 -0.561418 0.514474
C  -4.821971 0.030279 -1.887168
C  -4.847924 -0.704052 0.444076
C  -5.546763 -0.395748 -0.747112
H  -2.624557 1.699447 2.525622
H  -2.285856 2.377799 0.840842
H  0.156258 2.799566 1.448245
H  -0.124852 2.131519 3.153211
H  0.755705 -0.164076 -2.055264
H  1.515703 0.212535 2.193005
H  3.244565 -0.541099 -2.460425
H  3.9771 -0.167363 1.793869
H  -2.843668 0.43713 -2.722339
H  -2.911115 -0.818682 1.434504
H  -5.351231 0.256441 -2.819643
H  -5.397775 -1.056581 1.324341
H  -6.636221 -0.499531 -0.791454
