program: Gaussian 09
title: 000226254
version: EM64L-G09RevD.01
frameworkgroup: C1[X(C20H26O4)]
method: RPBEPBE
basis: SDD
operation: Freq
keyword: #pfreq=noraman
keyword: PBEPBE/SDD
title: #p freq=noraman PBEPBE/SDD
converged: YES YES NO NO
title: Mulliken charges:
elementType: O O O O C C C C C C C C C C C C C C C C C C C C H H H H H H H H H H H H H H H H H H H H H H H H H H
charge: -0.274415 -0.270595 -0.269369 -0.264552 0.311131 -0.267110 -0.395984 -0.736900 -0.748782 -0.263304 0.255590 0.358840 -0.791730 -0.794384 -0.257286 -0.398343 -0.562225 0.555114 -0.514330 -0.421326 0.197258 0.162688 -0.331459 -0.204055 0.258257 0.265679 0.212778 0.220855 0.222036 0.263612 0.211957 0.207348 0.195954 0.227663 0.217856 0.216997 0.236851 0.219647 0.220897 0.219462 0.224399 0.226633 0.227791 0.209391 0.206369 0.257034 0.236379 0.248577 0.231112 0.239994
chargesum: 0.00000
title: Mulliken charges with hydrogens summed into heavy atoms:
elementType: O O O O C C C C C C C C C C C C C C C C C C C C
charge: -0.274415 -0.270595 -0.269369 -0.264552 0.311131 -0.008853 -0.130305 -0.081230 -0.065865 -0.067350 0.255590 0.358840 -0.129214 -0.116989 0.186574 0.056081 -0.146464 0.555114 -0.257296 -0.184948 0.197258 0.162688 -0.082882 0.267051
polarizability: 3.06876958e+02 1.78214413e+01 2.25712484e+02 -2.43871147e+01 -1.14212021e+01 1.88920345e+02
1716.lowfreq: -13.7954 -1.7489 -0.0009 -0.0006 0.0008 2.9660 7.9374 9.0975 16.7553
frequency: -6.1801 9.0319 16.7511 22.9018 33.3741 61.3351 71.4139 77.0910 85.1925 93.2904 105.7893 113.5241 136.5277 145.3795 160.6902 172.6141 175.5441 188.7779 211.2476 229.7552 236.4954 260.3701 279.6352 283.4658 313.0268 325.3860 334.0971 365.7608 387.0228 412.2004 416.3346 426.6071 441.5282 465.4841 499.3484 509.7891 519.2145 592.0215 623.2411 626.5014 676.8508 708.4228 718.0283 729.8749 749.1720 760.6947 777.5085 809.2606 814.1521 822.6419 838.3352 852.5291 860.1447 873.8664 884.0983 885.4274 915.2684 930.7238 948.8750 953.1935 968.6399 974.8145 983.3095 991.2058 1012.3660 1030.3729 1038.7831 1054.1645 1056.4441 1066.3160 1070.9574 1072.7909 1081.1704 1084.7949 1118.6084 1126.8273 1127.8019 1131.2194 1163.6394 1166.6043 1183.2950 1196.9049 1243.7673 1247.8547 1252.9642 1262.6152 1271.1189 1282.8778 1289.9390 1324.0186 1333.6353 1360.7823 1363.5472 1377.6571 1386.2116 1389.7526 1398.8241 1399.3462 1401.2995 1420.6739 1440.0872 1454.3103 1462.1989 1466.3656 1469.7488 1470.0499 1471.8866 1474.3907 1475.5829 1477.0078 1483.2127 1485.4309 1489.9266 1490.4709 1611.6342 1614.9939 1630.6540 1685.7344 2956.1024 2964.8912 2973.8901 2976.2092 2977.4469 2992.1056 2996.7723 3006.0010 3026.4876 3027.2255 3031.7883 3047.0373 3057.7218 3065.9303 3076.8499 3077.9120 3079.7596 3090.4288 3096.7459 3097.6079 3104.5471 3120.0850 3136.1224 3150.9511 3160.0330 3179.7400
redmass: 4.2447 5.1031 3.1024 5.0457 4.0603 4.2630 3.5918 3.6839 2.9640 1.8191 1.4425 1.8709 2.4309 4.3549 2.2577 1.4710 1.4303 1.9884 3.8890 2.1618 2.1996 3.5951 2.8952 3.0369 6.5445 3.4086 2.9113 2.7263 3.5922 3.5812 2.4785 3.4360 3.0402 3.0185 3.1682 3.2187 4.7288 5.4199 4.5983 4.5028 9.1999 6.0369 4.4246 5.2918 4.8906 1.1136 5.4546 3.4365 1.4879 3.3093 6.8457 1.3541 1.6312 1.5394 4.9789 3.2129 3.6411 1.3610 1.4119 1.4561 1.7417 5.2176 1.8338 1.2526 1.6845 3.5170 1.7796 2.3622 1.9338 1.7607 1.5269 1.4017 1.6616 3.0686 2.0742 1.1041 1.9387 1.3220 1.2188 2.5696 1.6767 2.1152 2.4513 3.0742 1.3217 1.4117 1.2911 1.1852 1.8114 1.6481 1.4547 1.6013 1.2674 1.6203 1.2357 1.2862 1.2605 3.7247 1.2499 2.2117 4.6262 1.0496 1.0536 1.0521 1.1205 1.0751 1.0466 1.5178 1.0989 1.2514 1.1457 1.3804 1.0626 1.0964 7.8471 9.7702 8.2916 6.3611 1.0373 1.0391 1.0367 1.0598 1.0364 1.0577 1.0608 1.0590 1.0968 1.1006 1.0963 1.1054 1.0989 1.0988 1.0980 1.1065 1.0978 1.0894 1.0984 1.0961 1.1104 1.0875 1.0899 1.0890 1.0929 1.0955
irintensity: 0.0029 0.0044 0.1870 0.1065 0.5264 1.3538 6.7093 1.2074 10.0315 0.1988 0.3703 0.0835 0.2233 1.0996 0.7966 1.0400 0.9076 3.4716 0.5493 1.4534 4.2042 3.9932 1.6541 0.5502 10.5628 4.5482 0.9117 0.6676 2.6759 2.4542 1.7700 5.1824 15.8614 0.4617 4.1224 3.3334 15.2043 3.0636 3.1656 11.4559 0.3175 5.8586 4.1091 10.7512 6.1229 3.0942 13.8254 33.0749 34.0558 3.2059 29.9029 3.3328 22.5845 21.0014 21.3400 28.2328 2.7197 1.0908 3.1825 3.1723 3.5832 147.7056 64.1197 2.0209 15.8604 2.2551 33.2523 33.6610 27.2245 1.4329 8.9018 15.2138 7.5326 103.4886 417.3326 0.2461 63.0674 5.3516 2.9517 72.6272 55.2022 65.4168 49.9758 147.1035 10.5843 12.9386 2.3450 0.6876 52.9658 22.4836 4.0253 75.4161 0.6374 24.8846 15.7040 37.8570 14.4565 9.4816 17.1455 73.5039 46.1275 1.4711 16.2020 6.5587 20.2533 2.1197 27.2119 57.0232 3.3789 44.3285 16.6153 40.0104 8.6398 17.2054 7.6042 161.2746 1.1501 5.9712 48.5415 61.7449 27.4116 27.9021 52.4730 16.5648 125.2123 35.4572 12.9865 10.0446 40.2514 0.7482 16.8539 46.7597 19.0139 49.6054 33.7269 31.0653 7.5641 28.8950 33.8149 11.8697 11.9970 4.6813 4.1596 4.9303
temp: 298.150 k
press: 1.00000 atm
elementType: 8 8 8 8 6 6 6 6 6 6 6 6 6 6 6 6 6 6 6 6 6 6 6 6 1 1 1 1 1 1 1 1 1 1 1 1 1 1 1 1 1 1 1 1 1 1 1 1 1 1
symmnumber: 1
zpe: 1084228.3 jmol-1
zpe.correction: 0.412961 hartree
zpe.thermalcorrener: 0.438087 hartree
zpe.thermalcorrenthalpy: 0.439031 hartree
zpe.thermalcorrgfe: 0.354165 hartree
zpe.sumelectzpe: -1076.753097 hartree
zpe.sumelectthermal: -1076.727971 hartree
zpe.sumelectthermalent: -1076.727027 hartree
zpe.sumelectthermalfe: -1076.811893 hartree
dipole: 0.3953 0.5201 1.6978
dipole: 1.8191
quadrupole: -132.1449 -139.0309 -142.8115
quadrupole: 5.2916 0.4342 -4.4918
quadrupole: 5.8508 -1.0351 -4.8157 5.2916 0.4342 -4.4918
hfenergy: -1077.166058 hartree
pointgroup: C01 [X(C20H26O4)]
dipole: -0.16697 -0.3179839 -0.6190447 debye
polarizability: 310.1200386|-23.4771449|215.8267835|-10.9326472|-16.6453775|195.5629646 unknown
InChI: InChI=1S/C20H26O4/c1-13(2)10-15-18(20(15,3)4)19(21)22-9-5-6-14-7-8-16-17(11-14)24-12-23-16/h7-8,10-11,15,18H,5-6,9,12H2,1-4H3
charge 0 multiplicity 1
50 atoms
O  -1.113111 -0.3126 0.588203
O  -2.654838 0.354583 2.21025
O  6.632887 -1.194818 -0.374378
O  7.233042 0.588683 -1.863975
C  -4.420672 -2.015433 0.968005
C  -4.860102 -0.675783 0.355488
C  -3.341955 -1.078082 0.336785
C  -4.684668 -3.318332 0.213178
C  -4.49754 -2.162612 2.486457
C  -5.614657 -0.553372 -0.917831
C  -2.398007 -0.284805 1.156091
C  -6.469983 0.453871 -1.268856
C  -7.18255 0.432547 -2.611237
C  -6.794489 1.655982 -0.400097
C  -0.06635 0.463203 1.312301
C  1.214924 0.35973 0.484328
C  2.389277 1.122317 1.160309
C  3.677035 1.038379 0.352232
C  4.504733 -0.121084 0.456107
C  4.044272 2.085556 -0.53044
C  5.649473 -0.17119 -0.33927
C  6.001882 0.877123 -1.215996
C  5.21841 2.026159 -1.332431
C  7.546517 -0.814019 -1.484529
H  -5.060984 0.093949 1.109889
H  -2.928893 -1.409928 -0.619811
H  -4.538211 -3.219192 -0.876257
H  -5.723188 -3.658828 0.385854
H  -4.001895 -4.110957 0.571555
H  -4.252319 -1.220067 3.00289
H  -5.518573 -2.470948 2.780767
H  -3.793736 -2.940069 2.840531
H  -5.46262 -1.362464 -1.647719
H  -6.91747 -0.458595 -3.206518
H  -6.931544 1.332067 -3.208628
H  -8.283138 0.440557 -2.477891
H  -6.254922 1.661337 0.56007
H  -7.880317 1.697558 -0.181858
H  -6.544416 2.5957 -0.931719
H  0.054744 0.03427 2.325286
H  -0.410962 1.50852 1.424135
H  1.485419 -0.704861 0.354993
H  1.035956 0.770748 -0.526495
H  2.100534 2.182809 1.29552
H  2.549804 0.704144 2.174248
H  4.253931 -0.9391 1.138195
H  3.404536 2.972749 -0.598524
H  5.498732 2.842121 -2.003279
H  7.354094 -1.474554 -2.35137
H  8.58621 -0.864769 -1.126059
