program: Gaussian 09
title: 000241938
version: EM64L-G09RevD.01
frameworkgroup: C1[X(C20H28O3)]
method: RPBEPBE
basis: SDD
operation: Freq
keyword: #pfreq=noraman
keyword: PBEPBE/SDD
title: #p freq=noraman PBEPBE/SDD
converged: NO YES NO NO
title: Mulliken charges:
elementType: O O O C C C C C C C C C C C C C C C C C C C C H H H H H H H H H H H H H H H H H H H H H H H H H H H H
charge: -0.426324 -0.220982 -0.449396 -0.155999 0.188190 0.260770 -0.473616 -0.538947 -0.459801 -0.451261 0.399198 -0.612425 -0.790289 0.320684 -0.781917 0.062639 -0.609437 -0.692169 0.419755 0.104999 -0.199775 -0.717132 -0.716425 0.246471 0.218742 0.206662 0.227111 0.224855 0.224994 0.200256 0.238129 0.200466 0.225399 0.219457 0.248648 0.230758 0.212102 0.242579 0.228594 0.227438 0.208197 0.240469 0.377111 0.202789 0.349358 0.249998 0.204406 0.215452 0.214901 0.204356 0.249966
chargesum: 0.00000
title: Mulliken charges with hydrogens summed into heavy atoms:
elementType: O O O C C C C C C C C C C C C C C C C C C C C
charge: -0.049213 -0.220982 -0.100038 0.090472 0.188190 0.260770 -0.048212 -0.086981 -0.034551 -0.012666 0.399198 -0.167570 -0.098782 0.320684 -0.083306 0.062639 -0.401240 -0.451700 0.419755 0.104999 0.003013 -0.047277 -0.047202
polarizability: 2.88937756e+02 -1.01079256e+00 2.09981352e+02 -3.16565698e+00 4.43970341e-01 1.67513245e+02
1716.lowfreq: -16.9183 -5.7870 -0.0005 0.0005 0.0007 6.5066 36.9881 46.7319 72.9091
frequency: 36.6425 46.3041 72.9001 83.8589 96.3508 114.6980 124.3154 148.8407 161.5436 194.8328 196.0334 215.5916 221.9483 232.2857 236.4059 246.6377 263.1894 273.0380 281.8317 297.9440 299.0022 304.9109 321.4053 337.6508 344.9528 351.2601 382.5952 404.1004 424.9394 442.4711 458.2321 463.6256 474.0902 478.4695 508.0870 521.9316 574.7012 592.6923 593.4586 628.0741 666.6588 688.7698 693.9366 717.9462 728.1804 737.1888 749.2531 794.5116 824.1261 843.1170 852.1844 866.2000 881.6239 902.5094 907.0118 916.4342 924.2149 954.3651 956.6957 965.6184 979.6495 994.1376 1000.9992 1014.3542 1041.1469 1052.6743 1069.4182 1073.2876 1087.4712 1089.3448 1116.4327 1120.6892 1123.7843 1145.0532 1153.4133 1170.0089 1185.9484 1194.4116 1203.4811 1213.7473 1219.7425 1236.3193 1245.5650 1266.5790 1268.5415 1284.0960 1293.8809 1306.5015 1307.0179 1312.6187 1323.3863 1334.1550 1336.5322 1343.4765 1349.0189 1361.5863 1370.9735 1384.6543 1388.7301 1392.2644 1393.3904 1411.9022 1453.0318 1459.2081 1459.3925 1462.4691 1465.5700 1472.7160 1475.2328 1478.9549 1479.7518 1483.1128 1491.0140 1492.2596 1497.2552 1507.1127 1589.2511 1620.0703 1636.4090 2951.3582 2969.5186 2972.4335 2977.1539 2980.6772 2981.5226 2983.4714 2986.6442 2991.2317 2993.4543 2995.7659 3019.4728 3027.9552 3043.8162 3057.2781 3063.3053 3066.2786 3070.7928 3078.1197 3079.4262 3093.6983 3095.1144 3095.4302 3099.9939 3100.4367 3102.9795 3511.1055 3571.0373
redmass: 4.1710 3.6466 3.4365 11.4859 3.4629 4.2952 2.9815 3.1092 3.2754 2.1354 1.6603 1.1255 2.6843 2.2054 2.4923 1.2811 2.5337 1.9341 2.8641 2.6069 2.5096 1.6959 2.8298 1.1314 3.4864 2.4194 2.8940 3.2972 2.8707 4.1907 3.1632 3.3216 3.3278 2.9502 3.1676 3.7018 2.1497 1.6477 2.6583 3.0778 2.9838 5.2378 3.7523 3.5342 5.4333 3.2958 3.4351 2.7110 1.8773 1.6659 1.9418 1.9352 2.4334 1.6841 1.7206 1.9799 1.2183 2.1029 1.4640 2.2433 1.6501 2.0067 1.9708 2.3492 2.0893 2.3672 2.1223 1.7698 1.9221 1.8789 2.5993 1.9294 2.3449 1.5972 1.7980 2.0154 2.1423 1.5040 1.4442 2.1448 1.5489 1.9769 1.8248 2.7872 1.6329 1.4578 1.4922 1.4316 1.5182 1.4891 1.7058 1.5557 1.4215 1.4122 1.4641 1.4812 1.1927 3.0321 1.3330 1.2467 1.2012 3.0134 1.0853 1.1113 1.0868 1.0426 1.0812 1.0765 1.0594 1.0724 1.0519 1.0838 1.0711 1.0643 1.0778 2.5551 6.7536 7.0547 8.4130 1.0650 1.0780 1.0614 1.0356 1.0651 1.0414 1.0640 1.0436 1.0425 1.0694 1.0613 1.0924 1.0993 1.0982 1.1006 1.0988 1.1000 1.0992 1.0978 1.0982 1.0977 1.0996 1.0893 1.0984 1.1012 1.0909 1.0640 1.0658
irintensity: 0.0124 0.1949 0.6047 1.1056 0.2056 0.1214 0.3969 0.0449 1.4975 0.7385 0.2405 0.0518 0.2244 0.2247 0.3704 0.5090 1.6168 0.6950 0.1207 0.8612 6.1207 0.3599 2.7905 99.9763 5.4033 1.0553 0.3688 6.6972 1.6909 4.5850 6.0416 6.0951 7.5711 1.3735 2.5650 7.3946 29.3053 67.6135 37.5246 21.9024 0.7001 0.6935 4.3226 5.9872 15.2095 6.4214 22.1951 0.0665 7.3548 20.4747 2.0447 10.3983 3.9227 8.3829 7.9175 1.3839 7.5767 16.3611 0.0146 10.8815 8.4307 6.6250 33.9798 171.9554 4.6811 18.2862 44.5683 55.3927 2.6927 6.5243 1.4466 127.5694 36.3900 24.1871 20.0802 1.8575 1.6916 2.1562 6.0092 6.4193 4.9693 4.0661 0.4087 13.3158 7.3333 9.7550 4.0222 9.8111 13.6527 6.1173 8.0866 2.0223 1.3779 3.1180 0.5388 9.3609 20.1819 7.9334 28.3675 5.9780 22.2110 24.9404 6.6890 7.5155 5.3974 1.5499 3.0752 18.5353 25.8201 12.7919 3.3750 17.7178 19.0341 4.5633 5.5980 68.9557 8.0289 12.7557 182.8946 33.4339 23.1780 27.7772 43.0765 5.9749 62.8782 5.0703 39.9628 17.3125 29.7684 44.7916 39.9318 31.0361 31.9941 35.1622 48.9807 20.9445 80.2278 29.1198 27.2210 31.7676 2.9259 34.3104 30.8040 18.9041 19.7904 23.7526 22.3523
temp: 298.150 k
press: 1.00000 atm
elementType: 8 8 8 6 6 6 6 6 6 6 6 6 6 6 6 6 6 6 6 6 6 6 6 1 1 1 1 1 1 1 1 1 1 1 1 1 1 1 1 1 1 1 1 1 1 1 1 1 1 1 1
symmnumber: 1
zpe: 1146411.6 jmol-1
zpe.correction: 0.436645 hartree
zpe.thermalcorrener: 0.459555 hartree
zpe.thermalcorrenthalpy: 0.460499 hartree
zpe.thermalcorrgfe: 0.387126 hartree
zpe.sumelectzpe: -1002.864356 hartree
zpe.sumelectthermal: -1002.841446 hartree
zpe.sumelectthermalent: -1002.840502 hartree
zpe.sumelectthermalfe: -1002.913875 hartree
dipole: 0.7025 0.6336 0.0865
dipole: 0.9500
quadrupole: -152.6099 -130.6920 -136.3963
quadrupole: 7.5155 2.5518 -1.4881
quadrupole: -12.7104 9.2074 3.5031 7.5155 2.5518 -1.4881
hfenergy: -1003.3010014 hartree
pointgroup: C01 [X(C20H28O3)]
dipole: 0.2754245 -0.2519692 -0.0185105 debye
polarizability: 288.9477599|0.8996069|209.8636811|3.0512492|-2.2114484|167.6209113 unknown
InChI: InChI=1S/C20H28O3/c1-12(2)14-10-13-6-7-17-19(3,15(13)11-16(14)21)8-5-9-20(17,4)18(22)23/h10-12,17,21-22H,5-9H2,1-4H3
charge 0 multiplicity 1
51 atoms
O  3.795576 -0.303761 -2.173232
O  4.796778 1.275172 -0.81582
O  -3.884137 2.058023 -0.213359
C  1.801939 -0.736083 -0.10292
C  0.903668 0.563425 -0.001767
C  3.330454 -0.469522 0.219118
C  1.176919 1.306328 1.352391
C  1.208815 -1.878012 0.761196
C  3.50902 0.314253 1.54867
C  2.668763 1.605582 1.60719
C  -0.607642 0.201162 -0.038174
C  -0.150364 -2.310023 0.183041
C  1.212536 1.511333 -1.201052
C  -1.098127 -1.129987 0.044326
C  4.144314 -1.805655 0.298754
C  4.025715 0.292945 -0.919509
C  -1.566011 1.246098 -0.116225
C  -2.497358 -1.358016 0.018999
C  -3.462506 -0.332386 -0.075903
C  -2.952261 0.993513 -0.135772
C  -4.954883 -0.665752 -0.094415
C  -5.638736 -0.219532 -1.41539
C  -5.698266 -0.090097 1.141808
H  1.760818 -1.086926 -1.154368
H  0.781809 0.689049 2.183999
H  0.593874 2.247538 1.366202
H  1.084899 -1.557662 1.813887
H  1.882078 -2.752022 0.762945
H  4.579673 0.550581 1.690957
H  3.207083 -0.355448 2.378846
H  3.059091 2.335634 0.8746
H  2.783214 2.072688 2.604639
H  -0.611928 -3.08619 0.823407
H  0.017827 -2.783417 -0.8077
H  2.247698 1.889283 -1.180043
H  1.055196 0.986374 -2.160067
H  0.556884 2.399389 -1.19013
H  3.933688 -2.457631 -0.566181
H  5.229008 -1.591047 0.313893
H  3.905517 -2.349036 1.228743
H  -1.227963 2.290789 -0.159015
H  -2.855939 -2.394509 0.083621
H  4.312605 0.196242 -2.861616
H  -5.02914 -1.771472 -0.040204
H  -3.407841 2.924528 -0.251477
H  -5.600463 0.87786 -1.519627
H  -6.699324 -0.534495 -1.42064
H  -5.140518 -0.670236 -2.293224
H  -5.245688 -0.452885 2.082882
H  -6.760129 -0.400635 1.127038
H  -5.657636 1.012146 1.13918
