program: Gaussian 09
title: 000226233
version: EM64L-G09RevD.01
frameworkgroup: C1[X(C14H20N2O2)]
method: RPBEPBE
basis: SDD
operation: Freq
keyword: #p
keyword: freq=noraman
keyword: PBEPBE/SDD
title: #p freq=noraman PBEPBE/SDD
converged: YES YES NO NO
title: Mulliken charges:
elementType: O O N N C C C C C C C C C C C C C C H H H H H H H H H H H H H H H H H H H H
charge: -0.192581 -0.215721 -0.450761 -0.644578 -0.153817 -0.449260 -0.406528 -0.562775 -0.362639 0.229283 0.504703 -0.694701 -0.399815 -0.431110 -0.232258 -0.227053 -0.244168 0.279323 0.180326 0.218320 0.247775 0.229959 0.198716 0.191159 0.236721 0.180636 0.219394 0.215800 0.220576 0.208798 0.301999 0.245632 0.227925 0.224559 0.221637 0.226375 0.347351 0.310797
chargesum: 0.00000
title: Mulliken charges with hydrogens summed into heavy atoms:
elementType: O O N N C C C C C C C C C C C C C C
charge: -0.192581 -0.215721 -0.148762 0.013570 0.026509 0.016835 0.022146 -0.134895 0.037391 0.229283 0.504703 -0.049527 -0.154183 -0.203184 -0.007699 -0.005416 -0.017793 0.279323
polarizability: 2.07272541e+02 -9.41969164e+00 1.47003502e+02 -1.25728974e+01 -1.12622996e+01 1.53069325e+02
1716.lowfreq: -10.7163 -5.7551 -3.5490 0.0006 0.0007 0.0008 16.5336 18.3019 25.9749
frequency: 16.4839 17.8903 25.9577 34.7496 45.8404 62.3210 76.7704 81.1612 110.3244 126.9301 154.9151 185.2025 223.9295 230.6402 258.3747 280.2462 297.4941 334.5344 383.0098 402.8372 413.8028 429.4366 444.1072 509.6758 553.5496 560.0117 586.2461 604.6302 617.4495 657.0318 698.9087 705.8528 728.1888 754.1136 759.7301 788.4925 811.3447 853.8623 870.3161 887.1409 893.3728 907.5129 922.3406 975.4131 989.6485 992.5024 993.8381 1011.2354 1025.8753 1028.3095 1051.7782 1054.6518 1073.2399 1086.3367 1108.7127 1118.0169 1138.2944 1164.8516 1171.5327 1186.6492 1217.4641 1221.8294 1242.7941 1273.8197 1282.6540 1286.8479 1295.4899 1298.7712 1327.5440 1334.2574 1346.1185 1360.2724 1382.7787 1390.7978 1426.6173 1440.7057 1453.6447 1462.5728 1472.3775 1476.5477 1477.6904 1483.4659 1485.8272 1592.8843 1605.8594 1614.5271 1642.8047 1696.7905 2942.9801 2957.7148 2972.8625 2974.9313 2977.1423 2990.5856 3007.7815 3024.5811 3043.6176 3059.7290 3071.9567 3075.4776 3110.9804 3117.3032 3130.6154 3142.6439 3161.3034 3522.2848 3530.1369 3682.8198
redmass: 5.5066 4.0821 4.4172 5.5152 3.8780 3.1178 4.5708 1.6295 4.3371 3.8033 4.6981 2.6508 1.2543 3.1654 3.1400 4.3515 3.7342 2.5286 2.1551 2.8147 2.6534 2.2610 2.8312 3.2335 1.1840 3.3027 4.1213 1.1755 6.3564 2.5038 3.8104 1.8219 2.5596 1.5427 2.0317 1.4262 3.5543 1.2471 1.7299 2.3245 2.7608 2.1653 1.7668 1.3875 5.9924 1.4358 1.4735 3.4018 2.5001 2.7038 1.7604 1.9796 2.4348 1.8623 1.8867 2.0057 1.8803 1.6024 1.0591 1.1182 2.3822 1.3750 1.2321 1.2530 1.6129 1.3895 1.5806 1.3298 1.2675 1.4560 1.5243 1.4779 7.7082 1.2103 2.1349 2.1773 1.0802 1.0860 1.0633 1.0450 1.1127 2.2732 1.0760 6.0406 1.2065 6.1698 4.9097 6.9600 1.0825 1.0608 1.0592 1.0397 1.0572 1.0605 1.0972 1.1003 1.1036 1.1037 1.1004 1.0998 1.0872 1.0869 1.0909 1.0958 1.1015 1.0685 1.0533 1.1041
irintensity: 7.0530 0.5354 4.6530 8.3192 0.3203 0.2784 3.1599 0.2351 1.4113 0.8616 2.0734 0.5119 0.1382 1.5075 0.0776 4.3626 1.3657 0.8006 21.1774 0.0333 16.7408 40.7756 26.7117 5.6619 224.7883 23.3498 10.4108 78.1807 0.1564 5.8179 5.3390 62.3894 27.4648 6.6744 46.8861 12.2853 2.9160 0.0718 3.0275 7.4017 3.1820 11.7395 4.7250 0.0185 0.0290 0.6942 0.8110 1.7428 0.7571 13.9931 5.0296 15.1858 4.0551 9.8586 13.1624 10.0739 123.0735 79.9301 2.0574 0.3037 0.2947 5.5478 4.8506 2.0479 66.4824 58.3749 42.6974 0.5317 0.6628 1.7832 4.4480 6.6951 0.1452 11.8853 687.9768 6.9566 0.1632 2.2073 4.4842 11.4271 14.1446 17.6534 18.7527 1.6192 63.8313 10.3857 22.5077 351.3574 24.1809 38.8641 29.0279 24.0275 36.9852 50.2102 10.3446 8.8239 10.2114 27.6705 67.9432 49.7580 10.6795 4.7502 11.7659 43.4400 26.3080 10.7268 41.3450 32.6499
temp: 298.150 k
press: 1.00000 atm
elementType: 8 8 7 7 6 6 6 6 6 6 6 6 6 6 6 6 6 6 1 1 1 1 1 1 1 1 1 1 1 1 1 1 1 1 1 1 1 1
symmnumber: 1
zpe: 834806.9 jmol-1
zpe.correction: 0.317961 hartree
zpe.thermalcorrener: 0.337339 hartree
zpe.thermalcorrenthalpy: 0.338283 hartree
zpe.thermalcorrgfe: 0.265731 hartree
zpe.sumelectzpe: -804.107977 hartree
zpe.sumelectthermal: -804.088599 hartree
zpe.sumelectthermalent: -804.087655 hartree
zpe.sumelectthermalfe: -804.160207 hartree
dipole: 2.5012 2.0535 -6.0944
dipole: 6.9004
quadrupole: -89.3637 -112.7376 -106.8216
quadrupole: -4.4311 -17.1702 7.8785
quadrupole: 13.6106 -9.7633 -3.8473 -4.4311 -17.1702 7.8785
hfenergy: -804.4259382 hartree
pointgroup: C01 [X(C14H20N2O2)]
dipole: -0.9280647 0.8512304 2.405068 debye
polarizability: 206.7394019|9.2661584|147.3250955|-13.8954912|11.1952547|153.2808707 unknown
InChI: InChI=1S/C14H20N2O2/c1-2-6-12(13(17)16-14(15)18)10-9-11-7-4-3-5-8-11/h3-5,7-8,12,16H,2,6,9-10,15H2,1H3
charge 0 multiplicity 1
38 atoms
O  -1.677213 -0.43362 -1.544271
O  -2.594801 -3.12656 -0.703317
N  -2.379831 -1.135198 0.590292
N  -3.869009 -2.831246 1.227381
C  -1.0825 0.973477 0.373806
C  0.438341 0.984904 0.055705
C  -1.771766 2.268543 -0.139054
C  1.208855 -0.225565 0.65018
C  -3.260216 2.390834 0.258244
C  -1.725618 -0.254843 -0.302664
C  2.692271 -0.177399 0.312437
C  -3.891341 3.712838 -0.229398
C  3.150954 -0.591752 -0.965745
C  3.641587 0.315645 1.243651
C  4.519886 -0.513105 -1.304362
C  5.013013 0.396956 0.909298
C  5.456989 -0.016639 -0.367634
C  -2.932382 -2.422504 0.276271
H  -1.214435 0.911924 1.476702
H  0.878139 1.924771 0.442794
H  0.562406 0.994299 -1.043611
H  -1.679095 2.294786 -1.242424
H  -1.213139 3.141471 0.254995
H  1.071391 -0.237637 1.750043
H  0.765001 -1.160053 0.254902
H  -3.354126 2.321561 1.362699
H  -3.82768 1.537857 -0.164881
H  -4.955406 3.785726 0.060664
H  -3.835211 3.791022 -1.331008
H  -3.362858 4.586449 0.196713
H  -2.412646 -0.84111 1.569513
H  2.429826 -0.984445 -1.693796
H  3.304489 0.633776 2.238597
H  4.856671 -0.842081 -2.294119
H  5.732973 0.777344 1.643225
H  6.519772 0.042275 -0.628324
H  -4.259148 -3.764761 1.112413
H  -4.312441 -2.192141 1.884884
