program: Gaussian 09
title: 000241939
version: EM64L-G09RevD.01
frameworkgroup: C1[X(C21H30O3)]
method: RPBEPBE
basis: SDD
operation: Freq
keyword: #pfreq=noraman
keyword: PBEPBE/SDD
title: #p freq=noraman PBEPBE/SDD
converged: YES YES NO NO
title: Mulliken charges:
elementType: O O O C C C C C C C C C C C C C C C C C C C C C H H H H H H H H H H H H H H H H H H H H H H H H H H H H H H
charge: -0.279524 -0.236523 -0.441975 -0.056997 0.196485 0.194831 -0.466663 -0.505754 -0.451424 -0.462770 0.347927 -0.604209 -0.803483 0.292539 -0.772227 0.162071 -0.602722 -0.616148 0.443762 0.041354 -0.235962 -0.510529 -0.700824 -0.700418 0.175246 0.189165 0.213278 0.233805 0.209156 0.193970 0.224023 0.197706 0.242446 0.225008 0.216870 0.226103 0.227485 0.246770 0.219212 0.224939 0.240229 0.210603 0.236470 0.259962 0.243977 0.230529 0.239543 0.352291 0.206945 0.210261 0.227684 0.227772 0.210154 0.207584
chargesum: 0.00000
title: Mulliken charges with hydrogens summed into heavy atoms:
elementType: O O O C C C C C C C C C C C C C C C C C C C C C
charge: -0.279524 -0.236523 -0.089684 0.118249 0.196485 0.194831 -0.064220 -0.062793 -0.033431 -0.022617 0.347927 -0.162332 -0.103125 0.292539 -0.087848 0.162071 -0.392119 -0.379679 0.443762 0.041354 0.024000 0.203519 -0.055934 -0.054908
polarizability: 2.94678770e+02 4.48346277e+00 2.21819945e+02 -2.45093194e+00 9.43330590e+00 1.82533084e+02
1716.lowfreq: -6.6331 -1.8377 -0.0001 0.0001 0.0003 7.8204 22.9135 34.9793 43.4376
frequency: 22.5733 34.7548 43.4259 64.2011 86.3245 89.6247 110.7364 118.4092 134.5679 150.5421 168.5678 183.9807 198.8503 212.9657 217.4428 222.8039 235.4243 246.9326 252.3756 273.7804 282.9229 288.3423 292.6135 299.5387 308.6938 320.6036 328.8570 343.8782 353.8614 383.2011 394.5280 429.3251 437.7288 461.9350 467.2663 477.1169 502.8769 510.3080 544.2169 566.7507 592.5024 617.1610 673.7653 681.8818 704.0661 728.2397 741.4871 751.6604 769.7489 801.5332 827.7306 836.6480 843.4212 857.7677 883.4012 902.1178 908.7713 912.8823 920.8278 939.8424 949.2355 954.0859 967.9458 977.8584 1000.9870 1016.0383 1026.8088 1049.5867 1075.0956 1085.9299 1090.4574 1094.8474 1105.8090 1111.3107 1115.7987 1116.9232 1136.9506 1142.7755 1144.6538 1156.3982 1173.1829 1185.3072 1194.8938 1202.5199 1208.8679 1210.7121 1228.4497 1254.1676 1267.5998 1281.5027 1291.0681 1304.7904 1319.5847 1326.2280 1332.3342 1335.9819 1337.4516 1343.9092 1356.1547 1360.6413 1375.1950 1381.1065 1386.3766 1392.5821 1393.9857 1408.9206 1419.4128 1449.8690 1451.2097 1456.5428 1460.1714 1463.6854 1464.4311 1466.7836 1468.7675 1470.0348 1478.2107 1478.5193 1484.9647 1488.9667 1491.9125 1494.8367 1505.5797 1591.6042 1613.2238 1620.4960 2916.3737 2946.6383 2964.3036 2969.7597 2972.0304 2972.7833 2981.3195 2988.7522 2993.6206 3001.5360 3007.7474 3024.5539 3026.2867 3027.2430 3044.1607 3056.5907 3060.6923 3070.7954 3071.6275 3074.2813 3075.1475 3077.3589 3080.2753 3092.4523 3102.7209 3102.9955 3105.2171 3107.4071 3145.4070 3582.7812
redmass: 2.7743 4.1571 4.3098 4.8573 3.4316 3.3520 1.8413 1.6734 3.1964 3.4817 3.3556 2.7761 2.8431 2.4369 1.0538 1.4003 1.3732 1.1155 3.3969 2.1448 2.7107 2.7580 2.4060 2.6291 2.5657 2.4261 1.2669 2.5336 3.9395 3.8062 2.5153 3.2068 4.3822 2.9528 2.8023 4.2926 3.0159 3.8080 3.4520 2.4305 3.5838 3.0100 4.7752 4.3485 4.2065 5.3877 2.8966 4.0472 4.2618 2.5463 2.1159 1.9179 1.6929 1.7539 2.6259 1.5738 2.1370 2.3844 1.2001 2.1646 2.6921 1.4200 1.9882 1.7614 2.1842 2.1253 1.7336 2.1673 2.5714 1.8657 1.6480 2.3958 2.2320 1.3483 2.4810 2.6949 2.0771 1.5812 1.4467 2.0608 2.1500 2.0431 1.4612 1.6069 1.7915 2.2073 1.8463 1.6851 1.8155 2.0325 1.4578 1.4692 1.4531 1.2883 1.6089 1.4166 1.4805 1.6733 1.5111 1.4372 1.1956 1.2388 2.6338 1.2008 1.3580 3.2665 1.1851 1.0883 1.0509 1.0836 1.1141 1.0547 1.0748 1.0519 1.0441 1.0685 1.0737 1.0530 1.0931 1.0609 1.0622 1.0942 2.5046 6.9252 9.1447 7.0345 1.0819 1.0654 1.0605 1.0349 1.0628 1.0354 1.0376 1.0373 1.0627 1.0295 1.0865 1.0950 1.0721 1.0857 1.0967 1.1004 1.1001 1.1000 1.0982 1.1002 1.1003 1.0993 1.0990 1.0990 1.1042 1.0895 1.0980 1.0893 1.1047 1.0659
irintensity: 0.0084 0.2521 0.4976 0.8270 0.2665 0.5447 1.5433 0.3434 1.2172 1.1494 3.6033 0.1890 0.3974 2.8797 0.0387 1.3564 0.7672 0.3086 5.7033 1.7792 0.3654 1.1061 2.1968 0.5483 6.3550 12.5647 101.1041 1.5792 9.6983 6.8327 1.1311 1.6806 1.4571 1.3419 12.5767 0.4141 2.3252 4.8283 5.8859 3.6588 1.1117 6.6249 2.5953 0.2364 2.6468 8.3445 0.8390 11.1996 12.7603 1.0368 2.5266 5.2564 14.6768 4.4428 1.7708 16.4019 3.4302 2.3496 1.7359 1.3603 9.0010 0.0052 10.4719 18.6548 25.0888 2.7011 52.9333 10.4591 23.6947 33.6845 37.0163 38.2555 45.4645 15.8102 116.1900 7.7039 0.3852 130.3852 9.8732 23.5595 5.4620 8.2748 0.7642 18.1715 5.4803 23.3030 3.1371 2.0202 27.4756 2.8996 2.3088 16.1878 8.7479 0.4078 3.1340 5.8447 2.4766 1.3443 4.2372 4.5115 15.4402 13.0807 2.6683 15.6631 17.0953 44.9245 15.9601 9.9709 10.7043 3.0298 10.8456 2.3169 23.0569 3.3690 2.4746 6.2539 3.4139 23.8801 3.5252 10.2775 34.1858 5.0910 82.4856 9.0567 140.3218 14.8453 22.3715 34.6425 34.9020 32.2269 19.6554 44.6909 40.2729 22.8972 44.3330 36.3548 16.1651 52.8614 24.6846 0.6031 34.8499 31.8703 0.4588 58.7200 105.3693 38.7825 25.1291 23.2972 35.6152 30.5578 26.8994 38.6901 20.7319 5.9796 13.9866 25.6673
temp: 298.150 k
press: 1.00000 atm
elementType: 8 8 8 6 6 6 6 6 6 6 6 6 6 6 6 6 6 6 6 6 6 6 6 6 1 1 1 1 1 1 1 1 1 1 1 1 1 1 1 1 1 1 1 1 1 1 1 1 1 1 1 1 1 1
symmnumber: 1
zpe: 1217758.9 jmol-1
zpe.correction: 0.463820 hartree
zpe.thermalcorrener: 0.488705 hartree
zpe.thermalcorrenthalpy: 0.489649 hartree
zpe.thermalcorrgfe: 0.410683 hartree
zpe.sumelectzpe: -1042.076514 hartree
zpe.sumelectthermal: -1042.051629 hartree
zpe.sumelectthermalent: -1042.050685 hartree
zpe.sumelectthermalfe: -1042.129651 hartree
dipole: 0.8457 -0.8317 -0.0071
dipole: 1.1861
quadrupole: -156.4161 -135.9772 -141.1089
quadrupole: -8.5281 -0.0231 -0.2377
quadrupole: -11.9154 8.5236 3.3918 -8.5281 -0.0231 -0.2377
hfenergy: -1042.5403337 hartree
pointgroup: C01 [X(C21H30O3)]
dipole: -0.3324548 0.3273198 -0.0105751 debye
polarizability: 294.7287655|4.3444475|221.0816182|0.9519701|-10.8721814|183.2214151 unknown
InChI: InChI=1S/C21H30O3/c1-13(2)15-11-14-7-8-18-20(3,16(14)12-17(15)22)9-6-10-21(18,4)19(23)24-5/h11-13,18,22H,6-10H2,1-5H3
charge 0 multiplicity 1
54 atoms
O  -3.658217 1.565486 0.922862
O  -4.618934 -0.540236 0.988493
O  4.053312 -2.098846 1.000475
C  -1.489098 0.291943 -0.761595
C  -0.70716 -0.711504 0.168317
C  -3.041536 0.021532 -0.864703
C  -0.995241 -2.161359 -0.345747
C  -1.055428 1.750481 -0.488797
C  -3.255158 -1.454195 -1.315739
C  -2.502323 -2.483117 -0.448845
C  0.812494 -0.405092 0.080505
C  0.410313 1.932458 -0.929014
C  -1.112078 -0.59905 1.672047
C  1.324847 0.83289 -0.401604
C  -3.674548 0.953979 -1.946384
C  -3.836144 0.26665 0.431235
C  1.741918 -1.368465 0.550075
C  2.726377 1.046054 -0.403126
C  3.663471 0.094133 0.052508
C  3.131428 -1.130061 0.534499
C  5.169784 0.361955 0.037091
C  -4.423626 1.893371 2.149422
C  5.539593 1.574236 0.933174
C  5.693754 0.564438 -1.409906
H  -1.139581 0.060386 -1.795441
H  -0.517581 -2.904235 0.321611
H  -0.522885 -2.279169 -1.342992
H  -1.172436 1.999292 0.579886
H  -1.692579 2.460032 -1.044321
H  -2.901914 -1.530689 -2.364898
H  -4.336571 -1.682876 -1.314035
H  -2.628285 -3.491318 -0.889783
H  -2.96461 -2.523249 0.554339
H  0.78907 2.919998 -0.600572
H  0.453243 1.941619 -2.03949
H  -0.461765 -1.252531 2.281443
H  -0.98426 0.43111 2.047275
H  -2.154795 -0.909724 1.852111
H  -3.098786 0.873695 -2.8872
H  -4.714964 0.643086 -2.154905
H  -3.689618 2.008839 -1.629373
H  1.376375 -2.327635 0.940718
H  3.100744 2.008572 -0.777119
H  5.666913 -0.531591 0.4547
H  -5.504087 1.755404 1.976452
H  -4.183822 2.945935 2.356408
H  -4.106548 1.242214 2.98186
H  3.573367 -2.905894 1.310962
H  5.071688 2.50557 0.561931
H  6.635188 1.727274 0.943005
H  5.202648 1.416776 1.973516
H  5.467488 -0.313692 -2.041107
H  6.78967 0.715205 -1.406612
H  5.2314 1.451114 -1.883214
