program: Gaussian 09
title: 000241898
version: EM64L-G09RevD.01
frameworkgroup: C1[X(C16H18FN5S)]
method: RPBEPBE
basis: SDD
operation: Freq
keyword: #p
keyword: freq=noraman
keyword: PBEPBE/SDD
title: #p freq=noraman PBEPBE/SDD
converged: YES YES NO NO
title: Mulliken charges:
elementType: S F N N N N N C C C C C C C C C C C C C C C C H H H H H H H H H H H H H H H H H H
charge: 0.277064 -0.200261 -0.169542 -0.050410 -0.069616 -0.056468 -0.590605 -0.380741 -0.349343 -0.339987 0.171132 0.087425 -0.241203 -0.337581 -0.692309 -0.051758 -0.781599 0.314501 0.166893 -0.318028 -0.360400 -0.236821 -0.199373 0.209800 0.238467 0.203779 0.229781 0.193605 0.200247 0.264315 0.218560 0.215684 0.213168 0.287342 0.307993 0.248101 0.327219 0.329109 0.255394 0.231428 0.235037
chargesum: 0.00000
title: Mulliken charges with hydrogens summed into heavy atoms:
elementType: S F N N N N N C C C C C C C C C C C C C C C C
charge: 0.277064 -0.200261 -0.169542 -0.050410 -0.069616 -0.056468 0.065723 0.067526 0.084217 0.053864 0.171132 0.087425 0.023112 -0.337581 -0.044896 -0.051758 -0.186264 0.314501 0.166893 -0.069927 -0.105006 -0.005392 0.035664
polarizability: 3.64060802e+02 4.33745634e+00 2.06969986e+02 -7.96950581e+00 -2.17831105e+00 1.56181173e+02
1716.lowfreq: -20.0906 -3.6344 -0.0013 0.0004 0.0021 1.4044 7.9773 9.4566 19.2823
frequency: -15.6784 8.1437 19.1201 31.9377 39.1414 57.5626 65.3113 94.9897 108.5905 113.2011 144.1524 157.4685 194.1605 196.9111 212.5472 234.5248 248.2947 276.6641 288.0770 300.4856 344.9402 358.9931 407.1982 421.2248 430.7967 436.2458 458.4208 502.4523 511.5160 513.1697 529.3506 549.0557 577.7381 591.4765 625.5306 643.0807 660.6914 713.8329 726.2899 734.3154 735.7168 754.4413 767.6377 779.7302 787.3410 798.5570 811.0841 831.7831 861.6118 880.7295 892.7957 901.2603 924.6030 944.2556 959.3288 982.0141 1015.6544 1029.4392 1038.5173 1073.9255 1074.2323 1077.9651 1114.3323 1123.9871 1136.3861 1169.7318 1172.3210 1194.7427 1198.8526 1225.5938 1248.5866 1255.7012 1270.8997 1280.6547 1286.0094 1290.0721 1305.8724 1323.0695 1339.7998 1348.2825 1360.4301 1377.8908 1386.1887 1389.7066 1432.4938 1436.4984 1443.6170 1462.1119 1469.0112 1477.0778 1477.7697 1479.7983 1488.1265 1499.3118 1519.4089 1570.4836 1588.3504 1605.9202 1621.4953 2965.3936 2976.3068 2984.7200 3005.3367 3010.6719 3043.1799 3061.5465 3070.8850 3076.4234 3077.5002 3134.1122 3141.5675 3146.3503 3164.2733 3179.6011 3226.3865 3567.4448 3726.5715
redmass: 3.0432 5.7474 6.5589 5.0887 3.9015 2.1222 6.2037 2.3556 5.4102 6.5477 5.9619 5.2507 3.3718 5.3934 2.9172 1.3405 4.1609 3.2670 5.0996 4.8636 4.3728 4.3733 5.5048 5.0572 3.2601 1.2480 3.8986 6.0468 1.1511 4.4752 4.6675 5.3628 6.4009 7.9102 5.2672 4.9147 5.2425 10.9776 4.2500 2.3152 1.5754 2.9134 1.4886 3.9373 1.2719 7.3689 1.8395 4.3847 1.4694 8.7281 1.6490 1.7429 1.2575 1.3870 5.1312 1.3206 3.8652 2.0592 2.3370 2.0166 2.2992 2.1254 2.3488 3.9772 1.1491 1.0833 2.2408 2.0401 1.8450 2.2101 1.4164 1.5237 1.2990 1.4638 3.3377 1.0934 4.3407 2.5809 1.6486 2.0730 1.5709 6.2066 8.3770 1.2153 3.1084 1.6116 1.4312 1.2751 1.0714 1.0443 1.0778 2.7710 1.0966 2.8628 8.4213 9.7558 6.5535 1.5103 7.5579 1.0591 1.0363 1.0603 1.0621 1.0963 1.1021 1.0586 1.1030 1.0996 1.1037 1.0869 1.1071 1.0906 1.0956 1.0992 1.0980 1.0440 1.1059
irintensity: 0.1108 0.8499 0.4497 0.1592 1.1630 0.1418 1.0541 0.0150 0.5920 0.0103 0.4839 6.3265 2.9287 0.0574 0.0203 0.3436 0.7967 4.5624 2.5613 5.1881 7.0050 2.4642 4.8046 7.4723 7.2556 283.7407 5.5576 1.1973 0.8188 8.4651 2.6908 5.3224 13.2511 0.8123 8.3724 15.4128 8.6779 5.8611 19.8073 4.9382 9.4755 27.9596 67.8671 21.2682 0.6369 2.7005 7.4981 10.3441 0.4763 128.3831 4.7087 7.1262 5.4702 2.6130 12.4884 0.0205 2.4747 9.0238 7.9830 13.5281 5.5375 1.4719 16.7202 80.8603 11.1709 0.6279 20.5197 31.8799 30.4059 13.0826 20.2052 11.4688 0.5718 3.8964 21.1970 0.7288 93.9595 5.4699 10.5399 5.8438 49.5382 78.7571 0.0578 10.5448 56.7782 22.9133 13.9361 25.8237 0.7862 10.3731 10.7538 45.7717 14.2173 221.7144 332.4084 225.2502 12.9369 404.9029 4.1569 31.2677 32.1350 19.9989 55.2317 12.0189 6.6872 5.1644 6.5737 54.3156 81.7705 3.1281 0.9637 11.1955 18.0699 10.7725 0.1679 113.6880 43.6583
temp: 298.150 k
press: 1.00000 atm
elementType: 16 9 7 7 7 7 7 6 6 6 6 6 6 6 6 6 6 6 6 6 6 6 6 1 1 1 1 1 1 1 1 1 1 1 1 1 1 1 1 1 1
symmnumber: 1
zpe: 839653.4 jmol-1
zpe.correction: 0.319807 hartree
zpe.thermalcorrener: 0.341121 hartree
zpe.thermalcorrenthalpy: 0.342065 hartree
zpe.thermalcorrgfe: 0.265813 hartree
zpe.sumelectzpe: -1390.517644 hartree
zpe.sumelectthermal: -1390.496330 hartree
zpe.sumelectthermalent: -1390.495386 hartree
zpe.sumelectthermalfe: -1390.571638 hartree
dipole: 2.3249 2.1466 -1.9318
dipole: 3.7075
quadrupole: -98.3550 -135.7083 -142.7189
quadrupole: -0.8965 3.6435 -2.4110
quadrupole: 27.2391 -10.1143 -17.1248 -0.8965 3.6435 -2.4110
hfenergy: -1390.8374512 hartree
pointgroup: C01 [X(C16H18F1N5S1)]
dipole: -0.919519 -1.0284308 -0.4737113 debye
polarizability: 364.1315377|5.8768538|203.6936202|5.8724963|-12.6189664|159.3868022 unknown
InChI: InChI=1S/C16H18FN5S/c1-2-3-8-22-10-19-13-14(22)20-16(18)21-15(13)23-9-11-6-4-5-7-12(11)17/h4-7,10H,2-3,8-9,18H2,1H3
charge 0 multiplicity 1
41 atoms
S  1.597658 0.821614 -0.306432
F  4.185459 -0.269682 2.426872
N  -3.426364 0.890746 -0.796633
N  -1.461547 2.09189 -0.764314
N  -2.526942 -1.381246 -0.427008
N  -0.070541 -1.370844 -0.207336
N  -1.302902 -3.356573 -0.081769
C  -4.869258 0.593056 -0.822952
C  -5.485268 0.507212 0.59187
C  -6.995921 0.184502 0.548362
C  -2.407297 -0.037388 -0.583751
C  -1.194103 0.722806 -0.569453
C  -2.797233 2.148731 -0.891319
C  -0.005514 -0.024942 -0.364266
C  -7.61832 0.093949 1.958247
C  -1.309716 -1.988582 -0.246173
C  2.740214 -0.691397 -0.019083
C  4.171385 -0.224086 0.000519
C  4.866444 -0.021371 1.213866
C  4.895653 0.03137 -1.193899
C  6.202607 0.40436 1.287404
C  6.239208 0.463309 -1.160673
C  6.893896 0.650683 0.080199
H  -5.370097 1.379544 -1.417798
H  -5.002467 -0.369925 -1.348845
H  -5.321898 1.466078 1.122721
H  -4.952083 -0.275242 1.164872
H  -7.525046 0.96189 -0.040422
H  -7.150976 -0.774256 0.013018
H  -3.367628 3.060381 -1.059335
H  -8.6978 -0.137539 1.908083
H  -7.129544 -0.697535 2.556373
H  -7.501451 1.048122 2.505363
H  2.534698 -1.391518 -0.842367
H  2.427536 -1.147468 0.929917
H  4.386051 -0.107186 -2.1542
H  -2.183058 -3.863228 -0.096965
H  -0.417628 -3.831263 0.067431
H  6.676924 0.537425 2.2640
H  6.774016 0.654564 -2.09662
H  7.93575 0.986041 0.111294
