program: Gaussian 09
title: 000241853
version: EM64L-G09RevD.01
frameworkgroup: C1[X(C17H20O2S2)]
method: RPBEPBE
basis: SDD
operation: Freq
keyword: #p
keyword: freq=noraman
keyword: PBEPBE/SDD
title: #p freq=noraman PBEPBE/SDD
converged: YES YES NO NO
title: Mulliken charges:
elementType: S S O O C C C C C C C C C C C C C C C C C H H H H H H H H H H H H H H H H H H H H
charge: 0.793773 -0.023234 -0.552345 -0.517656 -0.533166 0.438500 0.476595 -0.752826 -0.291954 -0.392352 -0.329049 -0.348882 -0.389161 -0.321097 -0.224569 -0.240262 -0.239101 -0.232716 -0.686051 -0.225249 -0.223646 0.298703 0.266007 0.330771 0.194026 0.201331 0.243740 0.266065 0.289329 0.267985 0.193590 0.205785 0.236784 0.238809 0.238290 0.235161 0.217257 0.208766 0.205656 0.238087 0.238307
chargesum: 0.00000
title: Mulliken charges with hydrogens summed into heavy atoms:
elementType: S S O O C C C C C C C C C C C C C C C C C
charge: 0.793773 -0.023234 -0.552345 -0.517656 -0.234463 0.438500 0.476595 -0.156048 0.103403 -0.148612 -0.062984 -0.059553 -0.121176 0.078279 0.012215 -0.001454 -0.000811 0.002445 -0.054372 0.012839 0.014660
polarizability: 3.66403960e+02 -1.37247462e+01 3.12498306e+02 -2.11638343e+01 -4.14534288e+00 1.82383352e+02
1716.lowfreq: -9.3518 -6.4818 -4.5157 -0.0009 0.0012 0.0017 2.8513 11.4866 33.9234
frequency: -8.3278 9.3915 33.8275 35.6062 51.4400 57.2176 71.0180 79.6820 83.0690 89.0698 109.4234 123.3871 135.0189 162.3061 167.8518 222.4029 226.2959 240.1103 248.5227 273.4873 288.6035 299.7297 356.1995 372.7835 382.9280 396.5919 410.8203 458.0437 475.6444 547.3425 566.6589 606.7499 609.1479 612.2178 641.1815 685.2530 693.4956 737.5687 758.6719 774.0183 793.1966 804.2057 812.6884 840.0084 850.1257 867.1267 868.9014 899.9654 907.5894 925.2286 937.1576 976.0031 980.7764 986.5537 990.3528 1001.1430 1003.5543 1014.1193 1026.1295 1026.7585 1035.9323 1061.6485 1068.7701 1084.3357 1099.8401 1108.6506 1177.0118 1177.9154 1195.4313 1199.7188 1203.0127 1208.1335 1225.9602 1233.7638 1278.3178 1292.9618 1305.7804 1321.7576 1335.0353 1351.5987 1373.0254 1386.3169 1388.4464 1406.4977 1427.4032 1441.6296 1451.3272 1454.3618 1471.1146 1476.6351 1479.5464 1484.0751 1489.1233 1572.2326 1574.0201 1599.9815 1607.3897 2936.5535 2959.3063 2967.6462 2971.4614 3002.0512 3027.1674 3052.2727 3066.7365 3072.3427 3091.2313 3132.8004 3133.9284 3139.6331 3142.5162 3151.9516 3153.3511 3163.6261 3166.5372 3173.8688 3177.0020
redmass: 4.4177 5.4066 3.8755 4.5965 4.9024 5.2955 5.4319 2.5716 2.6113 4.7259 4.9422 7.8906 6.5876 6.3828 8.4281 3.2937 1.3146 6.4834 4.1174 2.4987 5.6118 2.9405 5.7468 18.3158 9.0489 2.7793 2.8974 2.6302 3.4168 3.4152 5.9276 4.6845 6.2229 6.5049 5.8489 1.6827 1.7495 1.1639 2.0390 1.8654 1.6246 13.2772 3.7014 1.2707 1.2702 1.4220 4.1179 5.1834 1.6621 1.4229 1.4142 1.4229 1.8706 5.3015 2.6163 1.3523 1.3632 2.6761 2.2318 2.1527 1.2388 1.6293 1.5883 1.6566 1.6120 2.1012 1.0631 1.0676 1.1186 1.4304 1.2679 2.4254 1.3618 1.2749 1.1688 1.1543 1.2647 1.6531 1.3137 1.5881 2.6552 7.7982 1.2143 3.2224 1.0810 2.3770 1.0782 1.9972 1.0658 1.0427 2.1419 1.0700 2.6988 5.1252 5.5304 5.7633 5.8403 1.0655 1.0605 1.0603 1.0360 1.0975 1.1022 1.0960 1.1006 1.0991 1.0885 1.0859 1.0856 1.0887 1.0886 1.0926 1.0934 1.0963 1.0969 1.1010 1.0994
irintensity: 0.2834 0.6190 1.0437 0.7101 0.5657 1.1769 4.2192 2.5898 0.1997 4.2830 1.0188 24.3624 1.9205 8.0084 3.2003 3.1423 0.3942 1.2911 3.1215 4.5633 1.0933 3.4388 39.2557 63.8882 5.6268 3.1378 0.2417 3.2080 2.2417 64.4728 22.7410 2.5482 1.5128 0.6088 1.8436 71.6403 13.7180 11.1646 12.7184 44.7017 0.7484 66.7319 0.5452 4.2740 1.8472 4.0614 1.3707 54.4079 9.4223 4.5984 1.1888 0.7825 3.4600 4.1561 1.6390 0.4182 0.2353 5.0635 1.1936 5.3666 59.1046 1.5879 1.1296 3.2349 13.8031 3.9573 1.2730 0.3167 16.6907 17.7227 13.4136 6.2517 18.6023 3.3426 7.8491 32.2585 4.9160 52.6165 3.1378 2.4657 41.2522 1.0127 12.1751 15.8069 35.7881 25.5838 4.1850 40.8975 3.1136 12.7610 0.7070 13.3537 10.3646 0.5009 0.5613 63.9728 18.3216 8.9574 8.7049 42.0033 44.5181 0.5118 37.7171 11.1300 90.7471 48.6909 7.9335 0.9338 0.7320 1.5828 2.3827 13.1609 22.6085 26.1497 2.9078 30.1373 14.5040
temp: 298.150 k
press: 1.00000 atm
elementType: 16 16 8 8 6 6 6 6 6 6 6 6 6 6 6 6 6 6 6 6 6 1 1 1 1 1 1 1 1 1 1 1 1 1 1 1 1 1 1 1 1
symmnumber: 1
zpe: 851352.7 jmol-1
zpe.correction: 0.324263 hartree
zpe.thermalcorrener: 0.346244 hartree
zpe.thermalcorrenthalpy: 0.347188 hartree
zpe.thermalcorrgfe: 0.269807 hartree
zpe.sumelectzpe: -1604.694672 hartree
zpe.sumelectthermal: -1604.672691 hartree
zpe.sumelectthermalent: -1604.671747 hartree
zpe.sumelectthermalfe: -1604.749128 hartree
dipole: 2.4338 0.6462 -5.6427
dipole: 6.1790
quadrupole: -119.3584 -123.0566 -155.7849
quadrupole: 0.9741 0.5687 0.8329
quadrupole: 13.3749 9.6767 -23.0516 0.9741 0.5687 0.8329
hfenergy: -1605.0189347 hartree
pointgroup: C01 [X(C17H20O2S2)]
dipole: -0.8559528 1.0980244 1.9928796 debye
polarizability: 368.4684745|-3.4803691|301.2766379|-24.2496528|-32.0386419|191.5405057 unknown
InChI: InChI=1S/C13H11.C4H9S.O2S/c1-3-7-12(8-4-1)11-13-9-5-2-6-10-13;1-2-3-4-5;1-3-2/h1-11H;2-4H2,1H3;
charge 0 multiplicity 1
41 atoms
S  0.482344 -0.816672 -1.698655
S  2.868783 -0.000887 -1.588339
O  0.588379 -2.425911 -1.375314
O  -0.218579 -0.387804 -3.107039
C  -0.517806 0.347461 0.138886
C  -0.49697 1.71641 -0.384185
C  -1.715428 -0.447997 0.441977
C  3.562539 -1.685513 -1.091635
C  4.004728 -1.760362 0.378847
C  0.501916 2.61561 0.099258
C  -1.543191 -1.792004 0.90196
C  -1.37837 2.162937 -1.417262
C  -3.04155 0.075439 0.346425
C  5.172597 -0.812846 0.731644
C  0.569497 3.938751 -0.376095
C  -2.655533 -2.586584 1.229499
C  -1.296331 3.482474 -1.89918
C  -4.150484 -0.721841 0.688865
C  5.592145 -0.907392 2.213883
C  -0.334575 4.378804 -1.372612
C  -3.9647 -2.056417 1.122771
H  0.371231 0.07324 0.726476
H  4.397492 -1.884059 -1.787745
H  2.752021 -2.416077 -1.303825
H  3.137542 -1.544052 1.035153
H  4.307494 -2.807866 0.591892
H  1.212809 2.269004 0.857801
H  -0.534376 -2.214541 0.963628
H  -2.07448 1.458417 -1.881375
H  -3.196065 1.11737 0.053074
H  6.039924 -1.047771 0.081363
H  4.871914 0.227168 0.490129
H  1.331032 4.621461 0.014783
H  -2.507226 -3.61881 1.562821
H  -1.963735 3.807902 -2.703951
H  -5.16049 -0.302938 0.626115
H  6.429306 -0.2223 2.44158
H  5.916435 -1.933648 2.47138
H  4.749621 -0.645782 2.882072
H  -0.274213 5.40431 -1.753276
H  -4.830848 -2.674785 1.382805
