program: Gaussian 09
title: 000241842
version: EM64L-G09RevD.01
frameworkgroup: C1[X(C9H13N3O5)]
method: RPBEPBE
basis: SDD
operation: Freq
keyword: #p
keyword: freq=noraman
keyword: PBEPBE/SDD
title: #p freq=noraman PBEPBE/SDD
converged: NO YES NO NO
title: Mulliken charges:
elementType: O O O O O N N N C C C C C C C C C H H H H H H H H H H H H H
charge: -0.439161 -0.422031 -0.328329 -0.227975 -0.231746 -0.120890 -0.418489 -0.390779 -0.371742 -0.430629 0.188379 0.293928 -0.321700 -0.304125 -0.380508 0.136680 0.176325 0.268178 0.213652 0.248758 0.254269 0.225965 0.193930 0.236105 0.203765 0.379021 0.278775 0.369177 0.373788 0.347409
chargesum: 0.00000
title: Mulliken charges with hydrogens summed into heavy atoms:
elementType: O O O O O N N N C C C C C C C C C
charge: -0.065373 -0.074622 -0.328329 -0.227975 -0.231746 -0.120890 -0.039468 -0.021602 0.110088 0.072399 0.188379 0.293928 0.098194 0.135745 -0.101733 0.136680 0.176325
polarizability: 1.72686476e+02 3.24824134e+00 1.32295935e+02 -7.60942712e-01 2.55763666e+01 1.14942867e+02
1716.lowfreq: -5.9593 -0.0009 -0.0008 -0.0007 4.9977 6.5504 24.1098 38.5552 50.2737
frequency: 24.0028 38.5411 50.2381 70.2750 76.0315 98.4219 137.7052 153.8259 165.6636 167.2456 194.0521 233.1521 248.6698 289.8355 309.6807 329.7703 348.8406 379.7524 418.7443 441.1725 477.6258 508.9880 537.2253 550.6337 616.3617 653.7603 670.1342 680.1734 691.7398 728.4175 749.5410 775.9286 781.3351 814.6976 844.0032 866.1349 904.0856 969.2061 976.2139 981.2369 1018.7339 1024.3447 1027.3202 1048.7908 1063.8902 1111.0780 1147.4768 1181.6996 1201.3365 1207.6639 1273.1356 1276.4031 1296.6617 1312.5104 1331.9939 1346.4939 1347.1889 1362.6122 1370.6356 1384.8438 1407.8648 1413.4424 1447.4517 1461.6905 1467.1635 1471.2435 1483.3659 1556.4008 1597.8586 1648.7047 1682.5660 2947.6211 2970.8915 2998.0452 3029.8997 3061.3832 3075.4575 3084.5069 3118.2054 3211.4611 3413.3362 3507.9939 3526.2744 3567.2892
redmass: 5.4764 5.0248 4.0481 6.8516 3.3555 3.9750 3.8310 8.1734 5.4995 3.7308 4.5729 5.2646 4.8323 3.0118 1.2126 4.8353 5.8047 7.7824 4.7141 2.5805 4.6031 7.6320 5.9825 7.5058 4.7263 1.1645 2.4461 3.9611 2.0866 1.8640 3.6731 2.0276 2.1346 1.5533 1.4992 3.0579 2.9826 3.0820 3.7831 4.0565 3.4847 2.7992 4.5663 2.6368 1.6520 1.8467 2.8755 1.6803 1.3257 2.8294 1.3728 1.3116 1.4994 1.2442 1.4290 1.9906 1.4566 1.2289 1.8752 1.2274 2.1329 1.2165 1.2246 3.1204 1.0910 1.1404 1.1209 4.4636 7.7367 6.8239 5.8957 1.0695 1.0681 1.0612 1.0642 1.0977 1.0981 1.0959 1.1004 1.0942 1.0649 1.0774 1.0773 1.0667
irintensity: 0.0867 1.4267 4.5827 1.3887 7.2728 5.9191 0.4735 1.0204 0.9567 12.4413 0.1684 5.2033 0.5291 36.1278 99.8700 40.0147 1.5478 31.7283 14.5219 2.3292 3.3733 14.6045 9.5779 2.9258 0.8318 118.6694 16.2862 62.7196 17.8870 55.0843 0.4039 106.0863 50.1335 6.6655 57.3341 3.3395 3.8547 9.1022 104.8313 27.1934 33.5058 104.1707 1.5936 19.1003 6.9839 8.0960 17.9499 82.6158 17.3598 25.0885 38.9094 1.4192 35.0911 33.7958 92.7329 51.8179 39.1871 21.9204 54.3023 8.5374 68.0478 132.1702 16.9317 105.9699 3.1568 3.7141 3.6463 238.3172 32.4806 409.3827 703.1566 52.5612 34.7301 20.5221 25.4514 23.3894 32.2363 12.0437 19.5075 2.5490 150.4533 120.0165 65.4266 14.3173
temp: 298.150 k
press: 1.00000 atm
elementType: 8 8 8 8 8 7 7 7 6 6 6 6 6 6 6 6 6 1 1 1 1 1 1 1 1 1 1 1 1 1
symmnumber: 1
zpe: 606733.9 jmol-1
zpe.correction: 0.231093 hartree
zpe.thermalcorrener: 0.248048 hartree
zpe.thermalcorrenthalpy: 0.248992 hartree
zpe.thermalcorrgfe: 0.184687 hartree
zpe.sumelectzpe: -889.852852 hartree
zpe.sumelectthermal: -889.835897 hartree
zpe.sumelectthermalent: -889.834953 hartree
zpe.sumelectthermalfe: -889.899258 hartree
dipole: -2.1303 3.6920 -0.3573
dipole: 4.2774
quadrupole: -117.3821 -118.9796 -107.0986
quadrupole: -5.8869 -3.4976 -5.1830
quadrupole: -2.8953 -4.4929 7.3882 -5.8869 -3.4976 -5.1830
hfenergy: -890.0839451 hartree
pointgroup: C01 [X(C9H13N3O5)]
dipole: -0.5812555 1.3584732 0.8054595 debye
polarizability: 171.6513117|-9.4441182|102.0334188|3.2449507|14.2219213|146.2405479 unknown
InChI: InChI=1S/C9H13N3O5/c13-3-1-12(2-4-14)8(16)6-5-7(15)11-9(17)10-6/h5,10-11,13-14H,1-4H2
charge 0 multiplicity 1
30 atoms
O  -3.846235 -1.725304 -1.350301
O  -1.245699 3.890297 1.640547
O  -1.221676 -0.993381 -1.524081
O  3.519408 -0.697561 -2.367686
O  3.284521 -0.842377 2.313982
N  -1.699548 0.365515 0.310485
N  1.435603 -0.45854 -1.320552
N  3.374468 -0.726016 -0.020672
C  -3.165476 0.282106 0.001334
C  -1.306533 1.445864 1.253441
C  -0.831435 -0.341665 -0.488102
C  0.648328 -0.409135 -0.172124
C  -3.757115 -1.155217 -0.016352
C  -1.484736 2.857794 0.631721
C  1.216356 -0.550538 1.075528
C  2.834603 -0.636002 -1.31674
C  2.666935 -0.720285 1.219001
H  -3.376783 0.744228 -0.982871
H  -3.666652 0.882926 0.780028
H  -0.257728 1.322405 1.558957
H  -1.934096 1.379817 2.160371
H  -4.799556 -1.107703 0.34258
H  -3.180395 -1.79994 0.682969
H  -2.525887 3.019435 0.309252
H  -0.820306 2.972329 -0.250792
H  0.960787 -0.51005 -2.22879
H  0.621414 -0.590493 1.987796
H  4.391156 -0.847202 0.031755
H  -2.928576 -1.670967 -1.742546
H  -0.277845 3.953061 1.841062
