program: Gaussian 09
title: 000241840
version: EM64L-G09RevD.01
frameworkgroup: C1[X(C12H10ClN3O2S)]
method: RPBEPBE
basis: SDD
operation: Freq
keyword: #p
keyword: freq=noraman
keyword: PBEPBE/SDD
title: #p freq=noraman PBEPBE/SDD
converged: YES YES NO NO
title: Mulliken charges:
elementType: Cl S O O N N N C C C C C C C C C C C C H H H H H H H H H H
charge: -0.060851 0.245260 -0.434526 -0.203201 -0.072558 -0.040225 -0.586875 0.632744 -0.865984 -0.297855 -0.355065 -0.167933 -0.219649 -0.229104 -0.237950 -0.224107 0.093324 -0.058969 0.140267 0.297862 0.308748 0.259746 0.257030 0.232941 0.287161 0.236712 0.343716 0.328993 0.390348
chargesum: 0.00000
title: Mulliken charges with hydrogens summed into heavy atoms:
elementType: Cl S O O N N N C C C C C C C C C C C C
charge: -0.060851 0.245260 -0.044178 -0.203201 -0.072558 -0.040225 0.085835 0.632744 -0.259374 -0.297855 -0.095319 -0.167933 0.037380 0.003837 0.049211 0.012606 0.093324 -0.058969 0.140267
polarizability: 2.63294286e+02 1.77674224e+01 1.97017564e+02 -2.85444843e-01 1.94275234e+00 1.17404176e+02
1716.lowfreq: -8.2333 -2.2930 0.0016 0.0017 0.0018 6.7198 14.3915 22.0380 26.8417
frequency: 14.2235 21.8471 26.7857 37.4080 92.7540 97.7165 128.9677 138.5949 170.2104 177.1328 190.2487 229.2442 282.6776 300.7880 345.9387 358.8783 382.8294 417.4395 428.3998 446.2059 479.3092 486.4091 499.7908 533.6175 544.3654 567.3865 581.2723 602.1101 615.0702 629.7314 641.0243 660.9394 739.2789 748.6849 767.1512 778.5725 812.1051 813.3406 874.7666 879.4180 882.7046 906.3705 956.5117 966.9011 990.3722 993.5659 1018.1617 1038.7023 1077.0133 1118.8111 1143.5039 1169.9179 1183.0337 1216.8797 1219.1300 1252.6991 1279.7686 1287.0664 1313.5319 1375.5979 1376.8917 1424.3448 1443.6298 1463.0596 1467.0193 1514.1483 1532.1131 1574.3649 1605.3334 1610.8258 1669.3422 3049.0143 3130.5525 3135.4255 3147.8162 3162.2307 3176.5315 3209.2860 3532.1017 3557.9526 3716.0902
redmass: 10.0274 7.5572 6.5249 10.5514 7.3358 7.8484 5.4937 7.5931 6.6846 6.5253 6.8091 5.3412 4.7347 5.8326 5.1862 5.4310 6.4525 3.6514 6.4519 3.5512 1.8551 1.7507 4.7874 4.3094 1.0757 5.8468 6.8655 1.7841 4.7108 4.9493 3.1205 6.7379 3.3093 8.0608 1.3586 5.2404 8.3050 4.6461 1.4319 1.7495 1.6025 6.9848 1.3749 6.8419 1.3648 2.1460 6.5642 2.1350 2.3294 1.6646 1.4717 1.0684 1.0820 4.2478 2.5440 1.1796 4.4657 1.4057 3.1658 3.7556 6.4236 1.9768 1.2920 3.4804 2.3963 6.4133 5.0374 6.1256 6.5944 1.5843 9.5507 1.0588 1.1066 1.0859 1.0907 1.0958 1.0993 1.0940 1.0643 1.0444 1.1058
irintensity: 0.1659 0.4470 0.8051 1.2430 0.8210 0.1539 0.4718 0.2983 2.4336 6.9974 7.3040 1.0434 3.7381 6.8204 10.1491 2.0742 7.5713 1.3540 1.2829 6.1794 61.4492 183.0122 3.5829 10.5585 61.5616 15.2800 1.7153 126.5811 61.0812 44.5746 18.8820 19.5238 17.1689 34.2110 64.1677 2.4076 40.7728 7.5724 2.7816 13.7431 19.9583 4.2997 3.0019 108.0726 0.6707 21.8062 56.3369 5.5592 229.2675 4.0150 14.6354 0.7281 0.8681 104.8746 4.2905 3.5763 22.6471 3.5960 84.4434 10.6144 0.9729 24.2856 10.9528 20.5472 42.9808 307.9754 341.1097 15.6810 14.5514 457.0798 208.4472 12.3471 5.7511 0.7801 6.0131 12.5083 13.3023 4.6712 46.1357 116.6364 50.1453
temp: 298.150 k
press: 1.00000 atm
elementType: 17 16 8 8 7 7 7 6 6 6 6 6 6 6 6 6 6 6 6 1 1 1 1 1 1 1 1 1 1
symmnumber: 1
zpe: 534915.9 jmol-1
zpe.correction: 0.203739 hartree
zpe.thermalcorrener: 0.221388 hartree
zpe.thermalcorrenthalpy: 0.222332 hartree
zpe.thermalcorrgfe: 0.154487 hartree
zpe.sumelectzpe: -1634.768632 hartree
zpe.sumelectthermal: -1634.750983 hartree
zpe.sumelectthermalent: -1634.750039 hartree
zpe.sumelectthermalfe: -1634.817884 hartree
dipole: -1.8340 2.3283 -0.1148
dipole: 2.9661
quadrupole: -133.8978 -109.4295 -117.7722
quadrupole: -13.5913 -4.6932 -5.9596
quadrupole: -13.5313 10.9370 2.5943 -13.5913 -4.6932 -5.9596
hfenergy: -1634.972371 hartree
pointgroup: C01 [X(C12H10Cl1N3O2S1)]
dipole: -0.8554485 0.5093021 0.6087749 debye
polarizability: 254.3365699|2.469238|136.6361114|30.2637359|35.2777554|186.7433448 unknown
InChI: InChI=1S/C12H10ClN3O2S/c13-8-4-2-1-3-7(8)6-19-10-5-9(11(17)18)15-12(14)16-10/h1-5,17H,6,14H2
charge 0 multiplicity 1
29 atoms
Cl -4.053496 -0.556594 -2.902716
S  -0.297618 -0.296189 -1.893748
O  4.453221 -2.109153 -0.424233
O  5.324817 -0.798992 1.286675
N  0.783223 1.220175 0.150786
N  2.97512 0.811373 1.166777
N  1.631941 2.596525 1.85349
C  -2.747573 0.40159 -0.599694
C  -1.676865 0.972593 -1.491292
C  -3.875257 -0.296826 -1.097611
C  -2.658739 0.557171 0.811019
C  0.967634 0.15422 -0.664085
C  -4.879489 -0.81883 -0.260909
C  -3.649373 0.041809 1.672479
C  2.145154 -0.644048 -0.614748
C  -4.763113 -0.645672 1.136863
C  3.118406 -0.261791 0.332767
C  1.804085 1.510129 1.03237
C  4.401957 -1.035347 0.483489
H  -2.056604 1.264395 -2.481201
H  -1.14914 1.809565 -1.008657
H  -1.784145 1.079801 1.213743
H  -5.732877 -1.34968 -0.69236
H  -3.554846 0.174351 2.755365
H  2.297538 -1.506586 -1.263224
H  -5.538484 -1.049165 1.796554
H  2.372911 2.833373 2.508592
H  0.79374 3.164942 1.772166
H  5.310675 -2.596538 -0.295757
